{"text_format":"1","workbook":"xlsx","n_sheets":6,"sheets":["How to use this spreadsheet","Results and Analysis","background calcs","results compilation","Data entry template","Test 1"],"not_rendered":{"charts":0,"images":0,"macros":1,"external_links":0,"defined_names":15,"comments":0,"pivot_tables":0},"unopened":[],"bounds":{"document_bytes":16777216,"sheet_cells":100000,"rows_first":2000,"rows_last":500,"rows_between":2000,"halvings":0,"cell_chars":16384,"cell_head_chars":4096},"cells_cut":0,"cells_raw":0,"read":"whole","date_system":"1900"}

{"sheet":"How to use this spreadsheet","index":0,"n_rows":14,"n_cols":2,"rows_kept":14,"cut":false,"hidden":false,"merged":[]}
["How To Use This Spreadsheet"]
[]
["1.","Enter test results into the \"Test 1\" data entry form (see the green tab at the bottom of the screen). This sheet may be renamed."]
[null,"- Sections in these sheets correspond exactly to the test sections and numbers on the Data Collection Form (see below for link)."]
[null,"- Data for only one stove model may be entered into this spreadsheet file. If multiple stoves are tested, a new copy of this file must be used for each."]
["2.","Click the button in the upper right corner of the \"Test 1\" sheet, or any subsequent data entry sheet, to add more sheets for additional test results."]
["3.","All results are summarized automatically in the \"Results and Analysis\" sheet (see the blue tab, below)"]
[null,"This sheet will format automatically for printing on paper or to a PDF file."]
[]
[]
[null,"The full cookstove usability protocol, including testing guidance and the form used to collect data for this spreadsheet, is available at:"]
[null,"https://humanitarian.engineering.oregonstate.edu/project-page/usability-testing-protocol-cookstoves"]
[]
[null,"For assistance using this spreadsheet: Please contact Nordica MacCarty at nordica.maccarty@oregonstate.edu"]

{"sheet":"Results and Analysis","index":1,"n_rows":115,"n_cols":28,"rows_kept":115,"cut":false,"hidden":false,"merged":[[48,14,49,14],[14,9,15,10],[16,9,18,10],[16,12,18,15],[5,12,5,14],[83,13,83,14],[60,14,61,14],[74,13,74,14],[56,13,56,14],[57,13,57,14],[35,10,36,10],[35,12,36,12],[23,12,24,12],[35,14,36,14],[5,4,5,6],[9,4,9,6],[7,4,7,6],[5,10,7,11],[114,9,114,10],[103,10,104,10],[87,10,88,10],[87,12,88,12],[87,14,88,14],[48,10,49,10],[48,12,49,12],[100,13,100,14],[60,10,61,10],[60,12,61,12],[77,10,78,10],[77,12,78,12],[84,13,84,14],[99,13,99,14],[77,14,78,14],[73,13,73,14],[11,13,11,14],[7,12,7,14],[44,13,44,14],[45,13,45,14],[34,20,34,22],[34,26,34,28],[35,18,35,20],[35,24,35,26],[36,18,36,20],[36,24,36,26],[26,26,26,28],[27,24,27,26],[28,24,28,26],[29,24,29,26],[30,24,30,26],[26,20,26,22],[27,18,27,20],[28,18,28,20],[29,18,29,20],[30,18,30,20],[31,24,31,26],[31,18,31,20],[42,20,42,22],[42,26,42,28],[43,18,43,20],[43,24,43,26],[44,18,44,20],[44,24,44,26],[37,18,37,20],[37,24,37,26],[39,18,39,20],[39,24,39,26],[38,24,38,26],[38,18,38,20],[46,28,47,28],[48,18,48,20],[48,24,48,26],[51,20,51,22],[51,26,51,28],[45,18,45,20],[45,24,45,26],[46,18,47,20],[46,21,47,21],[46,22,47,22],[46,24,47,26],[55,18,55,20],[55,24,55,26],[52,18,52,20],[52,24,52,26],[53,18,53,20],[53,24,53,26],[54,18,54,20],[54,24,54,26],[46,27,47,27],[56,18,56,20],[56,24,56,26],[65,24,65,26],[65,18,65,20],[63,18,63,20],[63,24,63,26],[64,18,64,20],[64,24,64,26],[58,18,59,18],[58,19,59,28],[61,24,61,26],[61,18,61,20],[62,18,62,20],[62,24,62,26]]}
[]
[null,"Usability Results and Analysis\n"]
[]
[null,"Test Details"]
[]
[null,null,null,"Stove Model:",null,null,null,null,null,null,"Administrator Names:"]
[]
[null,null,null,"Location:"]
[]
[null,null,null,"Date(s):"]
[]
[null,null,null,null,null,null,null,null,null,null,null,null,"Number of tests conducted:"]
[]
[]
[null,"Additional Inputs",null,null,null,null,null,null,null,"Confidence Level"]
[]
[null,null,null,null,"Currency type:",null,null,null,null,0.95,null,null,"← Enter confidence level (CL) for margin of error (ME)."]
[]
[null,null,null,null,"Avg. houshold income:",null,{"$f":"IF(F17=0,\"\",F17)&\"/yr.\"","v":"/yr."}]
[]
[null,null,null,null,"Fuel cost:",null,{"$f":"IF(F17=0,\"\",F17)&\"/kg\"","v":"/kg"}]
[]
[]
[null," Results Summary",null,null,null,null,null,null,null,null,null,null,{"$f":"\"Highest Sub-criteria ME (\"&(J17)*100&\"% CL)\"","v":"Highest Sub-criteria ME (95% CL)"},null,null,null,null," Interview Analysis"]
[null,null,null,null,null,null,null,null,null,null,"Score"]
[null,null,"I.","Fuel cost and convenience",null,null,null,null,null,null,{"$f":"N45","v":"N/A"},null,{"$f":"N46","v":"N/A"},null,null,null,null,null,"Q 5.1","\"Can you list a few of your favorite things about your stove? Why are they important to you?\""]
[null,null,"II.",{"$f":"C49","v":"Cooking performance"},null,null,null,null,null,null,{"$f":"N57","v":"N/A"},null,{"$f":"N58","v":"N/A"},null,null,null,null,null,"Code",null,"Times mentioned",null,null,null,"Code",null,"Times mentioned"]
[null,null,"III.",{"$f":"C61","v":"Operability"},null,null,null,null,null,null,{"$f":"N74","v":"N/A"},null,{"$f":"N75","v":"N/A"},null,null,null,null,null,{"$f":"IF('background calcs'!AV67<>0,'background calcs'!AU67,\"\")","v":""},null,null,{"$f":"IF('background calcs'!AV67<>0,'background calcs'!AV67,\"\")","v":""},null,null,{"$f":"IF('background calcs'!AV72<>0,'background calcs'!AU72,\"\")","v":""},null,null,{"$f":"IF('background calcs'!AV72<>0,'background calcs'!AV72,\"\")","v":""}]
[null,null,"IV.",{"$f":"C78","v":"Maintenance"},null,null,null,null,null,null,{"$f":"N84","v":"N/A"},null,{"$f":"N85","v":"N/A"},null,null,null,null,null,{"$f":"IF('background calcs'!AV68<>0,'background calcs'!AU68,\"\")","v":""},null,null,{"$f":"IF('background calcs'!AV68<>0,'background calcs'!AV68,\"\")","v":""},null,null,{"$f":"IF('background calcs'!AV73<>0,'background calcs'!AU73,\"\")","v":""},null,null,{"$f":"IF('background calcs'!AV73<>0,'background calcs'!AV73,\"\")","v":""}]
[null,null,"V.",{"$f":"C88","v":"Comfort"},null,null,null,null,null,null,{"$f":"N100","v":"N/A"},null,{"$f":"N101","v":"N/A"},null,null,null,null,null,{"$f":"IF('background calcs'!AV69<>0,'background calcs'!AU69,\"\")","v":""},null,null,{"$f":"IF('background calcs'!AV69<>0,'background calcs'!AV69,\"\")","v":""},null,null,{"$f":"IF('background calcs'!AV74<>0,'background calcs'!AU74,\"\")","v":""},null,null,{"$f":"IF('background calcs'!AV74<>0,'background calcs'!AV74,\"\")","v":""}]
[null,null,"VI.",{"$f":"C104","v":"Location-specific needs"},null,null,null,null,null,null,{"$f":"J115","v":"N/A"},null,null,null,null,null,null,null,{"$f":"IF('background calcs'!AV70<>0,'background calcs'!AU70,\"\")","v":""},null,null,{"$f":"IF('background calcs'!AV70<>0,'background calcs'!AV70,\"\")","v":""},null,null,{"$f":"IF('background calcs'!AV75<>0,'background calcs'!AU75,\"\")","v":""},null,null,{"$f":"IF('background calcs'!AV75<>0,'background calcs'!AV75,\"\")","v":""}]
[null,null,null,null,null,null,null,null,null,null,null,null,null,null,null,null,null,null,{"$f":"IF('background calcs'!AV71<>0,'background calcs'!AU71,\"\")","v":""},null,null,{"$f":"IF('background calcs'!AV71<>0,'background calcs'!AV71,\"\")","v":""},null,null,{"$f":"IF('background calcs'!AV76<>0,'background calcs'!AU76,\"\")","v":""},null,null,{"$f":"IF('background calcs'!AV76<>0,'background calcs'!AV76,\"\")","v":""}]
[]
[null,"I.","Fuel cost and convenience",null,null,null,null,null,null,null,null,null,null,null,null,null,null,null,"Q 5.2","\"Can you list a few of your least favorite things about your stove? Why are they important to you?\""]
[null,null,null,null,null,null,null,null,null,null,null,null,null,null,null,null,null,null,"Code",null,"Times mentioned",null,null,null,"Code",null,"Times mentioned"]
[null,null,null,null,null,null,null,null,null,null,"Result",null,"Relative Weight",null,{"$f":"\"ME    (\"&($J$17)*100&\"% CL)\"","v":"ME    (95% CL)"},null,null,null,{"$f":"IF('background calcs'!AY67<>0,'background calcs'!AX67,\"\")","v":""},null,null,{"$f":"IF('background calcs'!AY67<>0,'background calcs'!AY67,\"\")","v":""},null,null,{"$f":"IF('background calcs'!AY72<>0,'background calcs'!AX72,\"\")","v":""},null,null,{"$f":"IF('background calcs'!AY72<>0,'background calcs'!AY72,\"\")","v":""}]
[null,null,null,null,null,null,null,null,null,null,null,null,null,null,null,null,null,null,{"$f":"IF('background calcs'!AY68<>0,'background calcs'!AX68,\"\")","v":""},null,null,{"$f":"IF('background calcs'!AY68<>0,'background calcs'!AY68,\"\")","v":""},null,null,{"$f":"IF('background calcs'!AY73<>0,'background calcs'!AX73,\"\")","v":""},null,null,{"$f":"IF('background calcs'!AY73<>0,'background calcs'!AY73,\"\")","v":""}]
[null,null,"A.","Fuel availability",null,null,null,null,null,null,{"$f":"VLOOKUP(D38,'background calcs'!$E$19:$R$66,12,FALSE)","v":"N/A"},null,{"$f":"VLOOKUP(D38,'background calcs'!$E$19:$R$66,13,FALSE)","v":"N/A"},null,{"$f":"VLOOKUP(D38,'background calcs'!$E$19:$R$66,14,FALSE)","v":"N/A"},null,null,null,{"$f":"IF('background calcs'!AY69<>0,'background calcs'!AX69,\"\")","v":""},null,null,{"$f":"IF('background calcs'!AY69<>0,'background calcs'!AY69,\"\")","v":""},null,null,{"$f":"IF('background calcs'!AY74<>0,'background calcs'!AX74,\"\")","v":""},null,null,{"$f":"IF('background calcs'!AY74<>0,'background calcs'!AY74,\"\")","v":""}]
[null,null,"B.","Fuel preparation time (reported)",null,null,null,null,null,null,{"$f":"VLOOKUP(D39,'background calcs'!$E$19:$R$66,12,FALSE)","v":"N/A"},null,{"$f":"VLOOKUP(D39,'background calcs'!$E$19:$R$66,13,FALSE)","v":"N/A"},null,{"$f":"VLOOKUP(D39,'background calcs'!$E$19:$R$66,14,FALSE)","v":"N/A"},null,null,null,{"$f":"IF('background calcs'!AY70<>0,'background calcs'!AX70,\"\")","v":""},null,null,{"$f":"IF('background calcs'!AY70<>0,'background calcs'!AY70,\"\")","v":""},null,null,{"$f":"IF('background calcs'!AY75<>0,'background calcs'!AX75,\"\")","v":""},null,null,{"$f":"IF('background calcs'!AY75<>0,'background calcs'!AY75,\"\")","v":""}]
[null,null,null,"Fuel preparation time (measured)",null,null,null,null,null,null,{"$f":"TEXT(VLOOKUP(D40,'background calcs'!$E$19:$R$66,12,FALSE),\"hh:mm\")","v":"N/A"},null,null,null,{"$f":"VLOOKUP(D40,'background calcs'!$E$19:$R$66,14,FALSE)","v":"N/A"},null,null,null,{"$f":"IF('background calcs'!AY71<>0,'background calcs'!AX71,\"\")","v":""},null,null,{"$f":"IF('background calcs'!AY71<>0,'background calcs'!AY71,\"\")","v":""},null,null,{"$f":"IF('background calcs'!AY76<>0,'background calcs'!AX76,\"\")","v":""},null,null,{"$f":"IF('background calcs'!AY76<>0,'background calcs'!AY76,\"\")","v":""}]
[null,null,null,"Special knowledge/tools needed",null,null,null,null,null,null,{"$f":"VLOOKUP(D41,'background calcs'!$E$19:$R$66,12,FALSE)","v":"N/A"}]
[null,null,"C.","Fuel cost (% of income - self reported)",null,null,null,null,null,null,{"$f":"VLOOKUP(D42,'background calcs'!$E$19:$R$66,12,FALSE)","v":"N/A"},null,null,null,{"$f":"VLOOKUP(D42,'background calcs'!$E$19:$R$66,14,FALSE)","v":"N/A"},null,null,null,"Q 5.3","“Is there anything you would like to change about your stove?”"]
[null,null,null,"Fuel cost (% of income - outside estimate)",null,null,null,null,null,null,{"$f":"VLOOKUP(D43,'background calcs'!$E$19:$R$66,12,FALSE)","v":"N/A"},null,null,null,null,null,null,null,"Code",null,"Times mentioned",null,null,null,"Code",null,"Times mentioned"]
[null,null,null,null,null,null,null,null,null,null,null,null,null,null,null,null,null,null,{"$f":"IF('background calcs'!BB67<>0,'background calcs'!BA67,\"\")","v":""},null,null,{"$f":"IF('background calcs'!BB67<>0,'background calcs'!BB67,\"\")","v":""},null,null,{"$f":"IF('background calcs'!BB72<>0,'background calcs'!BA72,\"\")","v":""},null,null,{"$f":"IF('background calcs'!BB72<>0,'background calcs'!BB72,\"\")","v":""}]
[null,null,null,null,null,null,null,null,null,null,null,null,"Overall fuel score:",{"$f":"IFERROR(SUMPRODUCT(K38:K39,M38:M39)/SUM(M38:M39),\"N/A\")","v":"N/A"},null,null,null,null,{"$f":"IF('background calcs'!BB68<>0,'background calcs'!BA68,\"\")","v":""},null,null,{"$f":"IF('background calcs'!BB68<>0,'background calcs'!BB68,\"\")","v":""},null,null,{"$f":"IF('background calcs'!BB73<>0,'background calcs'!BA73,\"\")","v":""},null,null,{"$f":"IF('background calcs'!BB73<>0,'background calcs'!BB73,\"\")","v":""}]
[null,null,null,null,null,null,null,null,null,null,null,null,"Highest subcategory CoV:",{"$f":"IF(COUNTIF(K63:K64,\"<>N/A\")=0,\"N/A\",MAX(O38:O39))","v":"N/A"},null,null,null,null,{"$f":"IF('background calcs'!BB69<>0,'background calcs'!BA69,\"\")","v":""},null,null,{"$f":"IF('background calcs'!BB69<>0,'background calcs'!BB69,\"\")","v":""},null,null,{"$f":"IF('background calcs'!BB74<>0,'background calcs'!BA74,\"\")","v":""},null,null,{"$f":"IF('background calcs'!BB74<>0,'background calcs'!BB74,\"\")","v":""}]
[null,null,null,null,null,null,null,null,null,null,null,null,null,null,null,null,null,null,{"$f":"IF('background calcs'!BB70<>0,'background calcs'!BA70,\"\")","v":""},null,null,{"$f":"IF('background calcs'!BB70<>0,'background calcs'!BB70,\"\")","v":""},null,null,{"$f":"IF('background calcs'!BB75<>0,'background calcs'!BA75,\"\")","v":""},null,null,{"$f":"IF('background calcs'!BB75<>0,'background calcs'!BB75,\"\")","v":""}]
[]
[null,"II.","Cooking performance",null,null,null,null,null,null,null,"Result",null,"Relative Weight",null,{"$f":"\"ME    (\"&($J$17)*100&\"% CL)\"","v":"ME    (95% CL)"},null,null,null,{"$f":"IF('background calcs'!BB71<>0,'background calcs'!BA71,\"\")","v":""},null,null,{"$f":"IF('background calcs'!BB71<>0,'background calcs'!BB71,\"\")","v":""},null,null,{"$f":"IF('background calcs'!BB76<>0,'background calcs'!BA76,\"\")","v":""},null,null,{"$f":"IF('background calcs'!BB76<>0,'background calcs'!BC76,\"\")","v":""}]
[]
[null,null,"A.","Cooking speed (percieved)",null,null,null,null,null,null,{"$f":"VLOOKUP(D51,'background calcs'!$E$19:$R$66,12,FALSE)","v":"N/A"},null,{"$f":"VLOOKUP(D51,'background calcs'!$E$19:$R$66,13,FALSE)","v":"N/A"},null,{"$f":"VLOOKUP(D51,'background calcs'!$E$19:$R$66,14,FALSE)","v":"N/A"},null,null,null,"Q 5.4","\"Is there anything else you would like to tell me about your stove or cooking in general?\""]
[null,null,null,"Cooking duration (measured)",null,null,null,null,null,null,{"$f":"TEXT(VLOOKUP(D52,'background calcs'!$E$19:$R$66,12,FALSE),\"hh:mm\")","v":"N/A"},null,null,null,{"$f":"VLOOKUP(D52,'background calcs'!$E$19:$R$66,14,FALSE)","v":"N/A"},null,null,null,"Code",null,"Times mentioned",null,null,null,"Code",null,"Times mentioned"]
[null,null,"B.","Firepower control",null,null,null,null,null,null,{"$f":"VLOOKUP(D53,'background calcs'!$E$19:$R$66,12,FALSE)","v":"N/A"},null,{"$f":"VLOOKUP(D53,'background calcs'!$E$19:$R$66,13,FALSE)","v":"N/A"},null,{"$f":"VLOOKUP(D53,'background calcs'!$E$19:$R$66,14,FALSE)","v":"N/A"},null,null,null,{"$f":"IF('background calcs'!BE67<>0,'background calcs'!BD67,\"\")","v":""},null,null,{"$f":"IF('background calcs'!BE67<>0,'background calcs'!BE67,\"\")","v":""},null,null,{"$f":"IF('background calcs'!BE72<>0,'background calcs'!BD72,\"\")","v":""},null,null,{"$f":"IF('background calcs'!BE72<>0,'background calcs'!BE72,\"\")","v":""}]
[null,null,"C.","Firepower range",null,null,null,null,null,null,{"$f":"VLOOKUP(D54,'background calcs'!$E$19:$R$66,12,FALSE)","v":"N/A"},null,{"$f":"VLOOKUP(D54,'background calcs'!$E$19:$R$66,13,FALSE)","v":"N/A"},null,{"$f":"VLOOKUP(D54,'background calcs'!$E$19:$R$66,14,FALSE)","v":"N/A"},null,null,null,{"$f":"IF('background calcs'!BE68<>0,'background calcs'!BD68,\"\")","v":""},null,null,{"$f":"IF('background calcs'!BE68<>0,'background calcs'!BE68,\"\")","v":""},null,null,{"$f":"IF('background calcs'!BE73<>0,'background calcs'!BD73,\"\")","v":""},null,null,{"$f":"IF('background calcs'!BE73<>0,'background calcs'!BE73,\"\")","v":""}]
[null,null,"D.","Use of all pots and pans",null,null,null,null,null,null,{"$f":"VLOOKUP(D55,'background calcs'!$E$19:$R$66,12,FALSE)","v":"N/A"},null,{"$f":"VLOOKUP(D55,'background calcs'!$E$19:$R$66,13,FALSE)","v":"N/A"},null,{"$f":"VLOOKUP(D55,'background calcs'!$E$19:$R$66,14,FALSE)","v":"N/A"},null,null,null,{"$f":"IF('background calcs'!BE69<>0,'background calcs'!BD69,\"\")","v":""},null,null,{"$f":"IF('background calcs'!BE69<>0,'background calcs'!BE69,\"\")","v":""},null,null,{"$f":"IF('background calcs'!BE74<>0,'background calcs'!BD74,\"\")","v":""},null,null,{"$f":"IF('background calcs'!BE74<>0,'background calcs'!BE74,\"\")","v":""}]
[null,null,null,null,null,null,null,null,null,null,null,null,null,null,null,null,null,null,{"$f":"IF('background calcs'!BE70<>0,'background calcs'!BD70,\"\")","v":""},null,null,{"$f":"IF('background calcs'!BE70<>0,'background calcs'!BE70,\"\")","v":""},null,null,{"$f":"IF('background calcs'!BE75<>0,'background calcs'!BD75,\"\")","v":""},null,null,{"$f":"IF('background calcs'!BE75<>0,'background calcs'!BE75,\"\")","v":""}]
[null,null,null,null,null,null,null,null,null,null,null,null,"Overall performance score:",{"$f":"IFERROR((SUMPRODUCT(K51,M51)+SUMPRODUCT(K53:K55,M53:M55))/SUM(M51:M55),\"N/A\")","v":"N/A"},null,null,null,null,{"$f":"IF('background calcs'!BE71<>0,'background calcs'!BD71,\"\")","v":""},null,null,{"$f":"IF('background calcs'!BE71<>0,'background calcs'!BE71,\"\")","v":""},null,null,{"$f":"IF('background calcs'!BE76<>0,'background calcs'!BD76,\"\")","v":""},null,null,{"$f":"IF('background calcs'!BE76<>0,'background calcs'!BE76,\"\")","v":""}]
[null,null,null,null,null,null,null,null,null,null,null,null,"Highest subcategory margin of error:",{"$f":"IF(AND(O51=\"N/A\",COUNTIF(O53:O55,\"<>N/A\")=0),\"N/A\",MAX(O53:O55,O51))","v":"N/A"}]
[null,null,null,null,null,null,null,null,null,null,null,null,null,null,null,null,null,null,"Q 5.5","Additional question(s) and response(s)."]
[]
[null,"III.","Operability",null,null,null,null,null,null,null,"Result",null,"Relative Weight",null,{"$f":"\"ME    (\"&($J$17)*100&\"% CL)\"","v":"ME    (95% CL)"},null,null,null,"Code",null,null,"Times mentioned",null,null,"Code",null,null,"Times mentioned"]
[null,null,null,null,null,null,null,null,null,null,null,null,null,null,null,null,null,null,{"$f":"IF('background calcs'!BH67<>0,'background calcs'!BG67,\"\")","v":""},null,null,{"$f":"IF('background calcs'!BH67<>0,'background calcs'!BH67,\"\")","v":""},null,null,{"$f":"IF('background calcs'!BH72<>0,'background calcs'!BG72,\"\")","v":""},null,null,{"$f":"IF('background calcs'!BH72<>0,'background calcs'!BH72,\"\")","v":""}]
[null,null,"A.","Fuel feed entry size",null,null,null,null,null,null,{"$f":"VLOOKUP(D63,'background calcs'!$E$19:$R$66,12,FALSE)","v":"N/A"},null,{"$f":"VLOOKUP(D63,'background calcs'!$E$19:$R$66,13,FALSE)","v":4},null,{"$f":"VLOOKUP(D63,'background calcs'!$E$19:$R$66,14,FALSE)","v":"N/A"},null,null,null,{"$f":"IF('background calcs'!BH68<>0,'background calcs'!BG68,\"\")","v":""},null,null,{"$f":"IF('background calcs'!BH68<>0,'background calcs'!BH68,\"\")","v":""},null,null,{"$f":"IF('background calcs'!BH73<>0,'background calcs'!BG73,\"\")","v":""},null,null,{"$f":"IF('background calcs'!BH73<>0,'background calcs'!BH73,\"\")","v":""}]
[null,null,"B.","Tending frequency (percieved)",null,null,null,null,null,null,{"$f":"VLOOKUP(D64,'background calcs'!$E$19:$R$66,12,FALSE)","v":"N/A"},null,{"$f":"VLOOKUP(D64,'background calcs'!$E$19:$R$66,13,FALSE)","v":"N/A"},null,{"$f":"VLOOKUP(D64,'background calcs'!$E$19:$R$66,14,FALSE)","v":"N/A"},null,null,null,{"$f":"IF('background calcs'!BH69<>0,'background calcs'!BG69,\"\")","v":""},null,null,{"$f":"IF('background calcs'!BH69<>0,'background calcs'!BH69,\"\")","v":""},null,null,{"$f":"IF('background calcs'!BH74<>0,'background calcs'!BG74,\"\")","v":""},null,null,{"$f":"IF('background calcs'!BH74<>0,'background calcs'!BH74,\"\")","v":""}]
[null,null,null,"Tending frequency (measured)",null,null,null,null,null,null,{"$f":"IFERROR(TEXT(VLOOKUP(D65,'background calcs'!$E$19:$R$66,12,FALSE),\"hh:mm\")&\" min.\",\"N/A\")","v":"N/A"},null,null,null,{"$f":"VLOOKUP(D65,'background calcs'!$E$19:$R$66,14,FALSE)","v":"N/A"},null,null,null,{"$f":"IF('background calcs'!BH70<>0,'background calcs'!BG70,\"\")","v":""},null,null,{"$f":"IF('background calcs'!BH70<>0,'background calcs'!BH70,\"\")","v":""},null,null,{"$f":"IF('background calcs'!BH75<>0,'background calcs'!BG75,\"\")","v":""},null,null,{"$f":"IF('background calcs'!BH75<>0,'background calcs'!BH75,\"\")","v":""}]
[null,null,null,"Fuel reloading frequency (measured)",null,null,null,null,null,null,{"$f":"IFERROR(TEXT(VLOOKUP(D66,'background calcs'!$E$19:$R$66,12,FALSE),\"hh:mm\")&\" min.\",\"N/A\")","v":"N/A"},null,null,null,{"$f":"VLOOKUP(D66,'background calcs'!$E$19:$R$66,14,FALSE)","v":"N/A"},null,null,null,{"$f":"IF('background calcs'!BH71<>0,'background calcs'!BG71,\"\")","v":""},null,null,{"$f":"IF('background calcs'!BH71<>0,'background calcs'!BH71,\"\")","v":""},null,null,{"$f":"IF('background calcs'!BH76<>0,'background calcs'!BG76,\"\")","v":""},null,null,{"$f":"IF('background calcs'!BH76<>0,'background calcs'!BH76,\"\")","v":""}]
[null,null,"C.","Tending/refueling effort (percieved)",null,null,null,null,null,null,{"$f":"VLOOKUP(D67,'background calcs'!$E$19:$R$66,12,FALSE)","v":"N/A"},null,{"$f":"VLOOKUP(D67,'background calcs'!$E$19:$R$66,13,FALSE)","v":"N/A"},null,{"$f":"VLOOKUP(D67,'background calcs'!$E$19:$R$66,14,FALSE)","v":"N/A"}]
[null,null,"D.","Visibility of fire",null,null,null,null,null,null,{"$f":"VLOOKUP(D68,'background calcs'!$E$19:$R$66,12,FALSE)","v":"N/A"},null,{"$f":"VLOOKUP(D68,'background calcs'!$E$19:$R$66,13,FALSE)","v":4},null,{"$f":"VLOOKUP(D68,'background calcs'!$E$19:$R$66,14,FALSE)","v":"N/A"}]
[null,null,"E.","Ease of lighting",null,null,null,null,null,null,{"$f":"VLOOKUP(D69,'background calcs'!$E$19:$R$66,12,FALSE)","v":"N/A"},null,{"$f":"VLOOKUP(D69,'background calcs'!$E$19:$R$66,13,FALSE)","v":4},null,{"$f":"VLOOKUP(D69,'background calcs'!$E$19:$R$66,14,FALSE)","v":"N/A"}]
[null,null,"F.","Fire start-up delay",null,null,null,null,null,null,{"$f":"VLOOKUP(D70,'background calcs'!$E$19:$R$66,12,FALSE)","v":"N/A"},null,{"$f":"VLOOKUP(D70,'background calcs'!$E$19:$R$66,13,FALSE)","v":"N/A"},null,{"$f":"VLOOKUP(D70,'background calcs'!$E$19:$R$66,14,FALSE)","v":"N/A"}]
[null,null,"G.","User error",null,null,null,null,null,null,{"$f":"VLOOKUP(D71,'background calcs'!$E$19:$R$66,12,FALSE)","v":"N/A"},null,{"$f":"VLOOKUP(D71,'background calcs'!$E$19:$R$66,13,FALSE)","v":4},null,{"$f":"VLOOKUP(D71,'background calcs'!$E$19:$R$66,14,FALSE)","v":"N/A"}]
[null,null,"H.","User instruction",null,null,null,null,null,null,{"$f":"VLOOKUP(D72,'background calcs'!$E$19:$R$66,12,FALSE)","v":"N/A"},null,{"$f":"VLOOKUP(D72,'background calcs'!$E$19:$R$66,13,FALSE)","v":4},null,{"$f":"VLOOKUP(D72,'background calcs'!$E$19:$R$66,14,FALSE)","v":"N/A"}]
[]
[null,null,null,null,null,null,null,null,null,null,null,null,"Overall operability score:",{"$f":"IFERROR(IF(AND(COUNTIF(K63:K64,\"<>N/A\")=0,COUNTIF(K67:K72,\"<>N/A\")=0),N/A,(SUMPRODUCT(K63:K64,M63:M64)+SUMPRODUCT(K67:K72,M67:M72))/SUM(M63:M72)),\"N/A\")","v":"N/A"}]
[null,null,null,null,null,null,null,null,null,null,null,null,"Highest subcategory CoV:",{"$f":"IF(AND(COUNTIF(O63:O64,\"<>N/A\")=0,COUNTIF(O67:O72,\"<>N/A\")=0),\"N/A\",MAX(O63:O64,O67:O72))","v":"N/A"}]
[]
[]
[null,"IV.","Maintenance",null,null,null,null,null,null,null,"Result",null,"Relative Weight",null,{"$f":"\"ME    (\"&($J$17)*100&\"% CL)\"","v":"ME    (95% CL)"}]
[]
[null,null,"A.","Routine maintenance",null,null,null,null,null,null,{"$f":"VLOOKUP(D80,'background calcs'!$E$19:$R$66,12,FALSE)","v":"N/A"},null,{"$f":"VLOOKUP(D80,'background calcs'!$E$19:$R$66,13,FALSE)","v":"N/A"},null,{"$f":"VLOOKUP(D80,'background calcs'!$E$19:$R$66,14,FALSE)","v":"N/A"}]
[null,null,"B.","Long-term maintenance",null,null,null,null,null,null,{"$f":"VLOOKUP(D81,'background calcs'!$E$19:$R$66,12,FALSE)","v":"N/A"},null,{"$f":"VLOOKUP(D81,'background calcs'!$E$19:$R$66,13,FALSE)","v":"N/A"},null,{"$f":"VLOOKUP(D81,'background calcs'!$E$19:$R$66,14,FALSE)","v":"N/A"}]
[null,null,null,"Annual maintenance cost (% of income)",null,null,null,null,null,null,{"$f":"VLOOKUP(D82,'background calcs'!$E$19:$R$66,12,FALSE)","v":"N/A"},null,null,null,{"$f":"VLOOKUP(D82,'background calcs'!$E$19:$R$66,14,FALSE)","v":"N/A"}]
[]
[null,null,null,null,null,null,null,null,null,null,null,null,"Overall maintenance score:",{"$f":"IFERROR(SUMPRODUCT(K80:K81,M80:M81)/SUM(M80:M81),\"N/A\")","v":"N/A"}]
[null,null,null,null,null,null,null,null,null,null,null,null,"Highest subcategory CoV:",{"$f":"IF(COUNTIF(O80:O81,\"<>N/A\")=0,\"N/A\",MAX(O80:O81))","v":"N/A"}]
[]
[]
[null,"V.","Comfort",null,null,null,null,null,null,null,"Result",null,"Relative Weight",null,{"$f":"\"ME    (\"&($J$17)*100&\"% CL)\"","v":"ME    (95% CL)"}]
[]
[null,null,"A.","Perceived safety",null,null,null,null,null,null,{"$f":"VLOOKUP(D90,'background calcs'!$E$19:$R$66,12,FALSE)","v":"N/A"},null,{"$f":"VLOOKUP(D90,'background calcs'!$E$19:$R$66,13,FALSE)","v":"N/A"},null,{"$f":"VLOOKUP(D90,'background calcs'!$E$19:$R$66,14,FALSE)","v":"N/A"}]
[null,null,"B.","Perceived smoke exposure",null,null,null,null,null,null,{"$f":"VLOOKUP(D91,'background calcs'!$E$19:$R$66,12,FALSE)","v":"N/A"},null,{"$f":"VLOOKUP(D91,'background calcs'!$E$19:$R$66,13,FALSE)","v":"N/A"},null,{"$f":"VLOOKUP(D91,'background calcs'!$E$19:$R$66,14,FALSE)","v":"N/A"}]
[null,null,"C.","Cooking area soot deposits",null,null,null,null,null,null,{"$f":"VLOOKUP(D92,'background calcs'!$E$19:$R$66,12,FALSE)","v":"N/A"},null,{"$f":"VLOOKUP(D92,'background calcs'!$E$19:$R$66,13,FALSE)","v":2},null,{"$f":"VLOOKUP(D92,'background calcs'!$E$19:$R$66,14,FALSE)","v":"N/A"}]
[null,null,"D.","Pot soot deposits",null,null,null,null,null,null,{"$f":"VLOOKUP(D93,'background calcs'!$E$19:$R$66,12,FALSE)","v":"N/A"},null,{"$f":"VLOOKUP(D93,'background calcs'!$E$19:$R$66,13,FALSE)","v":2},null,{"$f":"VLOOKUP(D93,'background calcs'!$E$19:$R$66,14,FALSE)","v":"N/A"}]
[null,null,"E.","Cooking height",null,null,null,null,null,null,{"$f":"VLOOKUP(D94,'background calcs'!$E$19:$R$66,12,FALSE)","v":"N/A"},null,{"$f":"VLOOKUP(D94,'background calcs'!$E$19:$R$66,13,FALSE)","v":"N/A"},null,{"$f":"VLOOKUP(D94,'background calcs'!$E$19:$R$66,14,FALSE)","v":"N/A"}]
[null,null,"F.","Stove aesthetics",null,null,null,null,null,null,{"$f":"VLOOKUP(D95,'background calcs'!$E$19:$R$66,12,FALSE)","v":"N/A"},null,{"$f":"VLOOKUP(D95,'background calcs'!$E$19:$R$66,13,FALSE)","v":"N/A"},null,{"$f":"VLOOKUP(D95,'background calcs'!$E$19:$R$66,14,FALSE)","v":"N/A"}]
[null,null,"G.","Perceived durability",null,null,null,null,null,null,{"$f":"VLOOKUP(D96,'background calcs'!$E$19:$R$66,12,FALSE)","v":"N/A"},null,{"$f":"VLOOKUP(D96,'background calcs'!$E$19:$R$66,13,FALSE)","v":"N/A"},null,{"$f":"VLOOKUP(D96,'background calcs'!$E$19:$R$66,14,FALSE)","v":"N/A"}]
[null,null,"H.","Perceived value",null,null,null,null,null,null,{"$f":"VLOOKUP(D97,'background calcs'!$E$19:$R$66,12,FALSE)","v":"N/A"},null,{"$f":"VLOOKUP(D97,'background calcs'!$E$19:$R$66,13,FALSE)","v":"N/A"},null,{"$f":"VLOOKUP(D97,'background calcs'!$E$19:$R$66,14,FALSE)","v":"N/A"}]
[null,null,"I.","Taste",null,null,null,null,null,null,{"$f":"VLOOKUP(D98,'background calcs'!$E$19:$R$66,12,FALSE)","v":"N/A"},null,{"$f":"VLOOKUP(D98,'background calcs'!$E$19:$R$66,13,FALSE)","v":"N/A"},null,{"$f":"VLOOKUP(D98,'background calcs'!$E$19:$R$66,14,FALSE)","v":"N/A"}]
[]
[null,null,null,null,null,null,null,null,null,null,null,null,"Overall comfort score:",{"$f":"IFERROR(IF(COUNTIF(K90:K98,\"<>N/A\")=0,\"N/A\",SUMPRODUCT(K90:K98,M90:M98)/SUM(M90:M98)),\"N/A\")","v":"N/A"}]
[null,null,null,null,null,null,null,null,null,null,null,null,"Highest subcategory CoV:",{"$f":"IF(COUNTIF(O90:O98,\"<>N/A\")=0,\"N/A\",MAX(O90:O98))","v":"N/A"}]
[]
[]
[null,"VI.","Location-specific needs",null,null,null,null,null,null,null,"Need met by stove?"]
[]
[null,null,"A.","Space heating",null,null,null,null,null,null,{"$f":"IFERROR(VLOOKUP(D106,'background calcs'!$E$19:$R$66,12,FALSE)/(VLOOKUP(D106,'background calcs'!$E$19:$R$66,12,FALSE)+VLOOKUP(D106,'background calcs'!$E$19:$R$66,13,FALSE)),\"N/A\")","v":"N/A"}]
[null,null,"B.","Insect repellant",null,null,null,null,null,null,{"$f":"IFERROR(VLOOKUP(D107,'background calcs'!$E$19:$R$66,12,FALSE)/(VLOOKUP(D107,'background calcs'!$E$19:$R$66,12,FALSE)+VLOOKUP(D107,'background calcs'!$E$19:$R$66,13,FALSE)),\"N/A\")","v":"N/A"}]
[null,null,"C.","Lighting",null,null,null,null,null,null,{"$f":"IFERROR(VLOOKUP(D108,'background calcs'!$E$19:$R$66,12,FALSE)/(VLOOKUP(D108,'background calcs'!$E$19:$R$66,12,FALSE)+VLOOKUP(D108,'background calcs'!$E$19:$R$66,13,FALSE)),\"N/A\")","v":"N/A"}]
[null,null,"D.","Portability",null,null,null,null,null,null,{"$f":"IFERROR(VLOOKUP(D109,'background calcs'!$E$19:$R$66,12,FALSE)/(VLOOKUP(D109,'background calcs'!$E$19:$R$66,12,FALSE)+VLOOKUP(D109,'background calcs'!$E$19:$R$66,13,FALSE)),\"N/A\")","v":"N/A"}]
[null,null,"E.","Water heating",null,null,null,null,null,null,{"$f":"IFERROR(VLOOKUP(D110,'background calcs'!$E$19:$R$66,12,FALSE)/(VLOOKUP(D110,'background calcs'!$E$19:$R$66,12,FALSE)+VLOOKUP(D110,'background calcs'!$E$19:$R$66,13,FALSE)),\"N/A\")","v":"N/A"}]
[null,null,"F.","Food drying or smoking",null,null,null,null,null,null,{"$f":"IFERROR(VLOOKUP(D111,'background calcs'!$E$19:$R$66,12,FALSE)/(VLOOKUP(D111,'background calcs'!$E$19:$R$66,12,FALSE)+VLOOKUP(D111,'background calcs'!$E$19:$R$66,13,FALSE)),\"N/A\")","v":"N/A"}]
[null,null,"G.","Other 1:",null,null,null,null,null,null,{"$f":"IFERROR(VLOOKUP(D112,'background calcs'!$E$19:$R$66,12,FALSE)/(VLOOKUP(D112,'background calcs'!$E$19:$R$66,12,FALSE)+VLOOKUP(D112,'background calcs'!$E$19:$R$66,13,FALSE)),\"N/A\")","v":"N/A"}]
[null,null,"H.","Other 2:",null,null,null,null,null,null,{"$f":"IFERROR(VLOOKUP(D113,'background calcs'!$E$19:$R$66,12,FALSE)/(VLOOKUP(D113,'background calcs'!$E$19:$R$66,12,FALSE)+VLOOKUP(D113,'background calcs'!$E$19:$R$66,13,FALSE)),\"N/A\")","v":"N/A"}]
[]
[null,null,null,null,null,null,null,null,"Overall location-specific needs score:",{"$f":"IF(COUNTIF(K106:K113,\"<>N/A\")=0,\"N/A\",MIN(K106:K113))","v":"N/A"}]

{"sheet":"background calcs","index":2,"n_rows":150,"n_cols":136,"rows_kept":150,"cut":false,"hidden":true,"merged":[[3,13,3,15],[67,27,69,27]]}
[null,null,null,null,null,null,null,null,null,null,null,null,null,null,null,null,null,null,null,null,null,null,null,null,null,null,null,"Interview codes",null,null,null,null,null,null,null,null,null,null,null,null,null,null,null,null,null,null,null,null,null,null,null,null,null,null,null,null,null,null,null,null,null,null,null,null,null,null,null,null,null,null,null,null,null,null,null,null,null,null,null,null,null,null,null,null,null,null,null,null,null,null,null,null,null,null,null,null,null,null,null,null,null,null,null,null,null,null,null,null,null,null,null,null,null,null,null,null,null,null,null,null,null,null,null,null,null,null,null,null,null,null,"Unique codes "]
[null,"Date entry template data validation lists",null,null,null,null,null,null,null,null,null,null,null,null,null,null,null,null,null,null,null,null,null,null,null,null,null,null,null,null,"Test sheet #",null,null,null,null,null,null,null,null,null,null,null,null,null,null,null,null,null,null,null,null,null,null,null,null,null,null,null,null,null,null,null,null,null,null,null,null,null,null,null,null,null,null,null,null,null,null,null,null,null,null,null,null,null,null,null,null,null,null,null,null,null,null,null,null,null,null,null,null,null,null,null,null,null,null,null,null,null,null,null,null,null,null,null,null,null,null,null,null,null,null,null,null,null,null,null,null,null,null,null,null,5.0999999999999996,5.2,5.3,5.4,5.5]
[null,null,null,null,null,null,null,null,null,null,null,null,null,null,null,null,null,null,null,null,null,null,null,null,null,null,null,"Question #",null,"(template)",1,2,3,4,5,6,7,8,9,10,11,12,13,14,15,16,17,18,19,20,21,22,23,24,25,26,27,28,29,30,31,32,33,34,35,36,37,38,39,40,41,42,43,44,45,46,47,48,49,50,51,52,53,54,55,56,57,58,59,60,61,62,63,64,65,66,67,68,69,70,71,72,73,74,75,76,77,78,79,80,81,82,83,84,85,86,87,88,89,90,91,92,93,94,95,96,97,98,99,100]
[null,null,null,"Yes",null,1,"Days",null,null,null,null,null,null,"Conf int. alpha",null,null,{"$f":"1-'Results and Analysis'!J17","v":5.0000000000000044E-2},null,null,null,null,null,null,null,null,null,1,5.0999999999999996,null,null,null,null,null,null,null,null,null,null,null,null,null,null,null,null,null,null,null,null,null,null,null,null,null,null,null,null,null,null,null,null,null,null,null,null,null,null,null,null,null,null,null,null,null,null,null,null,null,null,null,null,null,null,null,null,null,null,null,null,null,null,null,null,null,null,null,null,null,null,null,null,null,null,null,null,null,null,null,null,null,null,null,null,null,null,null,null,null,null,null,null,null,null,null,null,null,null,null,null,null,null,1,{"$f":"IFERROR(LOOKUP(1, 1/((COUNTIF(EB$3:EB3, $AE$4:$DZ$4)=0)*($AE$4:$DZ$4<>\"\")), $AE$4:$DZ$4),\"\")","v":""},{"$f":"IFERROR(LOOKUP(1, 1/((COUNTIF(EC$3:EC3, $AE$16:$DZ$16)=0)*($AE$16:$DZ$16<>\"\")), $AE$16:$DZ$16),\"\")","v":""},{"$f":"IFERROR(LOOKUP(1, 1/((COUNTIF(ED$3:ED3, $AE$28:$DZ$28)=0)*($AE$28:$DZ$28<>\"\")), $AE$28:$DZ$28),\"\")","v":""},{"$f":"IFERROR(LOOKUP(1, 1/((COUNTIF(EE$3:EE3, $AE$40:$DZ$40)=0)*($AE$40:$DZ$40<>\"\")), $AE$40:$DZ$40),\"\")","v":""},{"$f":"IFERROR(LOOKUP(1, 1/((COUNTIF(EF$3:EF3, $AE$52:$DZ$52)=0)*($AE$52:$DZ$52<>\"\")), $AE$52:$DZ$52),\"\")","v":""}]
[null,null,null,"No",null,2,"Weeks",null,null,null,null,null,null,null,null,null,null,null,null,null,null,null,null,null,null,null,2,null,null,null,null,null,null,null,null,null,null,null,null,null,null,null,null,null,null,null,null,null,null,null,null,null,null,null,null,null,null,null,null,null,null,null,null,null,null,null,null,null,null,null,null,null,null,null,null,null,null,null,null,null,null,null,null,null,null,null,null,null,null,null,null,null,null,null,null,null,null,null,null,null,null,null,null,null,null,null,null,null,null,null,null,null,null,null,null,null,null,null,null,null,null,null,null,null,null,null,null,null,null,null,2,{"$f":"IFERROR(LOOKUP(1, 1/((COUNTIF(EB$3:EB4, $AE$4:$DZ$4)=0)*($AE$4:$DZ$4<>\"\")), $AE$4:$DZ$4),\"\")","v":""},{"$f":"IFERROR(LOOKUP(1, 1/((COUNTIF(EC$3:EC4, $AE$16:$DZ$16)=0)*($AE$16:$DZ$16<>\"\")), $AE$16:$DZ$16),\"\")","v":""},{"$f":"IFERROR(LOOKUP(1, 1/((COUNTIF(ED$3:ED4, $AE$28:$DZ$28)=0)*($AE$28:$DZ$28<>\"\")), $AE$28:$DZ$28),\"\")","v":""},{"$f":"IFERROR(LOOKUP(1, 1/((COUNTIF(EE$3:EE4, $AE$40:$DZ$40)=0)*($AE$40:$DZ$40<>\"\")), $AE$40:$DZ$40),\"\")","v":""},{"$f":"IFERROR(LOOKUP(1, 1/((COUNTIF(EF$3:EF4, $AE$52:$DZ$52)=0)*($AE$52:$DZ$52<>\"\")), $AE$52:$DZ$52),\"\")","v":""}]
[null,null,null,null,null,3,"Months",null,null,null,null,null,null,null,null,null,null,null,null,null,null,null,null,null,null,null,3,null,null,null,null,null,null,null,null,null,null,null,null,null,null,null,null,null,null,null,null,null,null,null,null,null,null,null,null,null,null,null,null,null,null,null,null,null,null,null,null,null,null,null,null,null,null,null,null,null,null,null,null,null,null,null,null,null,null,null,null,null,null,null,null,null,null,null,null,null,null,null,null,null,null,null,null,null,null,null,null,null,null,null,null,null,null,null,null,null,null,null,null,null,null,null,null,null,null,null,null,null,null,null,3,{"$f":"IFERROR(LOOKUP(1, 1/((COUNTIF(EB$3:EB5, $AE$4:$DZ$4)=0)*($AE$4:$DZ$4<>\"\")), $AE$4:$DZ$4),\"\")","v":""},{"$f":"IFERROR(LOOKUP(1, 1/((COUNTIF(EC$3:EC5, $AE$16:$DZ$16)=0)*($AE$16:$DZ$16<>\"\")), $AE$16:$DZ$16),\"\")","v":""},{"$f":"IFERROR(LOOKUP(1, 1/((COUNTIF(ED$3:ED5, $AE$28:$DZ$28)=0)*($AE$28:$DZ$28<>\"\")), $AE$28:$DZ$28),\"\")","v":""},{"$f":"IFERROR(LOOKUP(1, 1/((COUNTIF(EE$3:EE5, $AE$40:$DZ$40)=0)*($AE$40:$DZ$40<>\"\")), $AE$40:$DZ$40),\"\")","v":""},{"$f":"IFERROR(LOOKUP(1, 1/((COUNTIF(EF$3:EF5, $AE$52:$DZ$52)=0)*($AE$52:$DZ$52<>\"\")), $AE$52:$DZ$52),\"\")","v":""}]
[null,null,null,null,null,4,"Years",null,null,null,null,null,null,null,null,null,null,null,null,null,null,null,null,null,null,null,4,null,null,null,null,null,null,null,null,null,null,null,null,null,null,null,null,null,null,null,null,null,null,null,null,null,null,null,null,null,null,null,null,null,null,null,null,null,null,null,null,null,null,null,null,null,null,null,null,null,null,null,null,null,null,null,null,null,null,null,null,null,null,null,null,null,null,null,null,null,null,null,null,null,null,null,null,null,null,null,null,null,null,null,null,null,null,null,null,null,null,null,null,null,null,null,null,null,null,null,null,null,null,null,4,{"$f":"IFERROR(LOOKUP(1, 1/((COUNTIF(EB$3:EB6, $AE$4:$DZ$4)=0)*($AE$4:$DZ$4<>\"\")), $AE$4:$DZ$4),\"\")","v":""},{"$f":"IFERROR(LOOKUP(1, 1/((COUNTIF(EC$3:EC6, $AE$16:$DZ$16)=0)*($AE$16:$DZ$16<>\"\")), $AE$16:$DZ$16),\"\")","v":""},{"$f":"IFERROR(LOOKUP(1, 1/((COUNTIF(ED$3:ED6, $AE$28:$DZ$28)=0)*($AE$28:$DZ$28<>\"\")), $AE$28:$DZ$28),\"\")","v":""},{"$f":"IFERROR(LOOKUP(1, 1/((COUNTIF(EE$3:EE6, $AE$40:$DZ$40)=0)*($AE$40:$DZ$40<>\"\")), $AE$40:$DZ$40),\"\")","v":""},{"$f":"IFERROR(LOOKUP(1, 1/((COUNTIF(EF$3:EF6, $AE$52:$DZ$52)=0)*($AE$52:$DZ$52<>\"\")), $AE$52:$DZ$52),\"\")","v":""}]
[null,null,null,null,null,5,null,null,null,null,null,null,null,null,null,null,null,null,null,null,null,null,null,null,null,null,5,null,null,null,null,null,null,null,null,null,null,null,null,null,null,null,null,null,null,null,null,null,null,null,null,null,null,null,null,null,null,null,null,null,null,null,null,null,null,null,null,null,null,null,null,null,null,null,null,null,null,null,null,null,null,null,null,null,null,null,null,null,null,null,null,null,null,null,null,null,null,null,null,null,null,null,null,null,null,null,null,null,null,null,null,null,null,null,null,null,null,null,null,null,null,null,null,null,null,null,null,null,null,null,5,{"$f":"IFERROR(LOOKUP(1, 1/((COUNTIF(EB$3:EB7, $AE$4:$DZ$4)=0)*($AE$4:$DZ$4<>\"\")), $AE$4:$DZ$4),\"\")","v":""},{"$f":"IFERROR(LOOKUP(1, 1/((COUNTIF(EC$3:EC7, $AE$16:$DZ$16)=0)*($AE$16:$DZ$16<>\"\")), $AE$16:$DZ$16),\"\")","v":""},{"$f":"IFERROR(LOOKUP(1, 1/((COUNTIF(ED$3:ED7, $AE$28:$DZ$28)=0)*($AE$28:$DZ$28<>\"\")), $AE$28:$DZ$28),\"\")","v":""},{"$f":"IFERROR(LOOKUP(1, 1/((COUNTIF(EE$3:EE7, $AE$40:$DZ$40)=0)*($AE$40:$DZ$40<>\"\")), $AE$40:$DZ$40),\"\")","v":""},{"$f":"IFERROR(LOOKUP(1, 1/((COUNTIF(EF$3:EF7, $AE$52:$DZ$52)=0)*($AE$52:$DZ$52<>\"\")), $AE$52:$DZ$52),\"\")","v":""}]
[null,null,null,null,null,6,null,null,null,null,null,null,null,null,null,null,null,null,null,null,null,null,null,null,null,null,6,null,null,null,null,null,null,null,null,null,null,null,null,null,null,null,null,null,null,null,null,null,null,null,null,null,null,null,null,null,null,null,null,null,null,null,null,null,null,null,null,null,null,null,null,null,null,null,null,null,null,null,null,null,null,null,null,null,null,null,null,null,null,null,null,null,null,null,null,null,null,null,null,null,null,null,null,null,null,null,null,null,null,null,null,null,null,null,null,null,null,null,null,null,null,null,null,null,null,null,null,null,null,null,6,{"$f":"IFERROR(LOOKUP(1, 1/((COUNTIF(EB$3:EB8, $AE$4:$DZ$4)=0)*($AE$4:$DZ$4<>\"\")), $AE$4:$DZ$4),\"\")","v":""},{"$f":"IFERROR(LOOKUP(1, 1/((COUNTIF(EC$3:EC8, $AE$16:$DZ$16)=0)*($AE$16:$DZ$16<>\"\")), $AE$16:$DZ$16),\"\")","v":""},{"$f":"IFERROR(LOOKUP(1, 1/((COUNTIF(ED$3:ED8, $AE$28:$DZ$28)=0)*($AE$28:$DZ$28<>\"\")), $AE$28:$DZ$28),\"\")","v":""},{"$f":"IFERROR(LOOKUP(1, 1/((COUNTIF(EE$3:EE8, $AE$40:$DZ$40)=0)*($AE$40:$DZ$40<>\"\")), $AE$40:$DZ$40),\"\")","v":""},{"$f":"IFERROR(LOOKUP(1, 1/((COUNTIF(EF$3:EF8, $AE$52:$DZ$52)=0)*($AE$52:$DZ$52<>\"\")), $AE$52:$DZ$52),\"\")","v":""}]
[null,null,null,null,null,7,null,null,null,null,null,null,null,null,null,null,null,null,null,null,null,null,null,null,null,null,7,null,null,null,null,null,null,null,null,null,null,null,null,null,null,null,null,null,null,null,null,null,null,null,null,null,null,null,null,null,null,null,null,null,null,null,null,null,null,null,null,null,null,null,null,null,null,null,null,null,null,null,null,null,null,null,null,null,null,null,null,null,null,null,null,null,null,null,null,null,null,null,null,null,null,null,null,null,null,null,null,null,null,null,null,null,null,null,null,null,null,null,null,null,null,null,null,null,null,null,null,null,null,null,7,{"$f":"IFERROR(LOOKUP(1, 1/((COUNTIF(EB$3:EB9, $AE$4:$DZ$4)=0)*($AE$4:$DZ$4<>\"\")), $AE$4:$DZ$4),\"\")","v":""},{"$f":"IFERROR(LOOKUP(1, 1/((COUNTIF(EC$3:EC9, $AE$16:$DZ$16)=0)*($AE$16:$DZ$16<>\"\")), $AE$16:$DZ$16),\"\")","v":""},{"$f":"IFERROR(LOOKUP(1, 1/((COUNTIF(ED$3:ED9, $AE$28:$DZ$28)=0)*($AE$28:$DZ$28<>\"\")), $AE$28:$DZ$28),\"\")","v":""},{"$f":"IFERROR(LOOKUP(1, 1/((COUNTIF(EE$3:EE9, $AE$40:$DZ$40)=0)*($AE$40:$DZ$40<>\"\")), $AE$40:$DZ$40),\"\")","v":""},{"$f":"IFERROR(LOOKUP(1, 1/((COUNTIF(EF$3:EF9, $AE$52:$DZ$52)=0)*($AE$52:$DZ$52<>\"\")), $AE$52:$DZ$52),\"\")","v":""}]
[null,null,null,null,null,8,null,null,null,null,null,null,null,null,null,null,null,null,null,null,null,null,null,null,null,null,8,null,null,null,null,null,null,null,null,null,null,null,null,null,null,null,null,null,null,null,null,null,null,null,null,null,null,null,null,null,null,null,null,null,null,null,null,null,null,null,null,null,null,null,null,null,null,null,null,null,null,null,null,null,null,null,null,null,null,null,null,null,null,null,null,null,null,null,null,null,null,null,null,null,null,null,null,null,null,null,null,null,null,null,null,null,null,null,null,null,null,null,null,null,null,null,null,null,null,null,null,null,null,null,8,{"$f":"IFERROR(LOOKUP(1, 1/((COUNTIF(EB$3:EB10, $AE$4:$DZ$4)=0)*($AE$4:$DZ$4<>\"\")), $AE$4:$DZ$4),\"\")","v":""},{"$f":"IFERROR(LOOKUP(1, 1/((COUNTIF(EC$3:EC10, $AE$16:$DZ$16)=0)*($AE$16:$DZ$16<>\"\")), $AE$16:$DZ$16),\"\")","v":""},{"$f":"IFERROR(LOOKUP(1, 1/((COUNTIF(ED$3:ED10, $AE$28:$DZ$28)=0)*($AE$28:$DZ$28<>\"\")), $AE$28:$DZ$28),\"\")","v":""},{"$f":"IFERROR(LOOKUP(1, 1/((COUNTIF(EE$3:EE10, $AE$40:$DZ$40)=0)*($AE$40:$DZ$40<>\"\")), $AE$40:$DZ$40),\"\")","v":""},{"$f":"IFERROR(LOOKUP(1, 1/((COUNTIF(EF$3:EF10, $AE$52:$DZ$52)=0)*($AE$52:$DZ$52<>\"\")), $AE$52:$DZ$52),\"\")","v":""}]
[null,null,null,null,null,9,null,null,null,null,null,null,null,null,null,null,null,null,null,null,null,null,null,null,null,null,9,null,null,null,null,null,null,null,null,null,null,null,null,null,null,null,null,null,null,null,null,null,null,null,null,null,null,null,null,null,null,null,null,null,null,null,null,null,null,null,null,null,null,null,null,null,null,null,null,null,null,null,null,null,null,null,null,null,null,null,null,null,null,null,null,null,null,null,null,null,null,null,null,null,null,null,null,null,null,null,null,null,null,null,null,null,null,null,null,null,null,null,null,null,null,null,null,null,null,null,null,null,null,null,9,{"$f":"IFERROR(LOOKUP(1, 1/((COUNTIF(EB$3:EB11, $AE$4:$DZ$4)=0)*($AE$4:$DZ$4<>\"\")), $AE$4:$DZ$4),\"\")","v":""},{"$f":"IFERROR(LOOKUP(1, 1/((COUNTIF(EC$3:EC11, $AE$16:$DZ$16)=0)*($AE$16:$DZ$16<>\"\")), $AE$16:$DZ$16),\"\")","v":""},{"$f":"IFERROR(LOOKUP(1, 1/((COUNTIF(ED$3:ED11, $AE$28:$DZ$28)=0)*($AE$28:$DZ$28<>\"\")), $AE$28:$DZ$28),\"\")","v":""},{"$f":"IFERROR(LOOKUP(1, 1/((COUNTIF(EE$3:EE11, $AE$40:$DZ$40)=0)*($AE$40:$DZ$40<>\"\")), $AE$40:$DZ$40),\"\")","v":""},{"$f":"IFERROR(LOOKUP(1, 1/((COUNTIF(EF$3:EF11, $AE$52:$DZ$52)=0)*($AE$52:$DZ$52<>\"\")), $AE$52:$DZ$52),\"\")","v":""}]
[null,null,null,null,null,"Plancha",null,null,null,null,null,null,null,null,null,null,null,null,null,null,null,null,null,null,null,null,10,null,null,null,null,null,null,null,null,null,null,null,null,null,null,null,null,null,null,null,null,null,null,null,null,null,null,null,null,null,null,null,null,null,null,null,null,null,null,null,null,null,null,null,null,null,null,null,null,null,null,null,null,null,null,null,null,null,null,null,null,null,null,null,null,null,null,null,null,null,null,null,null,null,null,null,null,null,null,null,null,null,null,null,null,null,null,null,null,null,null,null,null,null,null,null,null,null,null,null,null,null,null,null,10,{"$f":"IFERROR(LOOKUP(1, 1/((COUNTIF(EB$3:EB12, $AE$4:$DZ$4)=0)*($AE$4:$DZ$4<>\"\")), $AE$4:$DZ$4),\"\")","v":""},{"$f":"IFERROR(LOOKUP(1, 1/((COUNTIF(EC$3:EC12, $AE$16:$DZ$16)=0)*($AE$16:$DZ$16<>\"\")), $AE$16:$DZ$16),\"\")","v":""},{"$f":"IFERROR(LOOKUP(1, 1/((COUNTIF(ED$3:ED12, $AE$28:$DZ$28)=0)*($AE$28:$DZ$28<>\"\")), $AE$28:$DZ$28),\"\")","v":""},{"$f":"IFERROR(LOOKUP(1, 1/((COUNTIF(EE$3:EE12, $AE$40:$DZ$40)=0)*($AE$40:$DZ$40<>\"\")), $AE$40:$DZ$40),\"\")","v":""},{"$f":"IFERROR(LOOKUP(1, 1/((COUNTIF(EF$3:EF12, $AE$52:$DZ$52)=0)*($AE$52:$DZ$52<>\"\")), $AE$52:$DZ$52),\"\")","v":""}]
[null,null,null,null,null,null,null,null,null,null,null,null,null,null,null,null,null,null,null,null,null,null,null,null,null,null,11,null,null,null,null,null,null,null,null,null,null,null,null,null,null,null,null,null,null,null,null,null,null,null,null,null,null,null,null,null,null,null,null,null,null,null,null,null,null,null,null,null,null,null,null,null,null,null,null,null,null,null,null,null,null,null,null,null,null,null,null,null,null,null,null,null,null,null,null,null,null,null,null,null,null,null,null,null,null,null,null,null,null,null,null,null,null,null,null,null,null,null,null,null,null,null,null,null,null,null,null,null,null,null,11,{"$f":"IFERROR(LOOKUP(1, 1/((COUNTIF(EB$3:EB13, $AE$4:$DZ$4)=0)*($AE$4:$DZ$4<>\"\")), $AE$4:$DZ$4),\"\")","v":""},{"$f":"IFERROR(LOOKUP(1, 1/((COUNTIF(EC$3:EC13, $AE$16:$DZ$16)=0)*($AE$16:$DZ$16<>\"\")), $AE$16:$DZ$16),\"\")","v":""},{"$f":"IFERROR(LOOKUP(1, 1/((COUNTIF(ED$3:ED13, $AE$28:$DZ$28)=0)*($AE$28:$DZ$28<>\"\")), $AE$28:$DZ$28),\"\")","v":""},{"$f":"IFERROR(LOOKUP(1, 1/((COUNTIF(EE$3:EE13, $AE$40:$DZ$40)=0)*($AE$40:$DZ$40<>\"\")), $AE$40:$DZ$40),\"\")","v":""},{"$f":"IFERROR(LOOKUP(1, 1/((COUNTIF(EF$3:EF13, $AE$52:$DZ$52)=0)*($AE$52:$DZ$52<>\"\")), $AE$52:$DZ$52),\"\")","v":""}]
[null,null,null,null,null,null,null,null,null,null,null,null,null,null,null,null,null,null,null,null,null,null,null,null,null,null,12,null,null,null,null,null,null,null,null,null,null,null,null,null,null,null,null,null,null,null,null,null,null,null,null,null,null,null,null,null,null,null,null,null,null,null,null,null,null,null,null,null,null,null,null,null,null,null,null,null,null,null,null,null,null,null,null,null,null,null,null,null,null,null,null,null,null,null,null,null,null,null,null,null,null,null,null,null,null,null,null,null,null,null,null,null,null,null,null,null,null,null,null,null,null,null,null,null,null,null,null,null,null,null,12,{"$f":"IFERROR(LOOKUP(1, 1/((COUNTIF(EB$3:EB14, $AE$4:$DZ$4)=0)*($AE$4:$DZ$4<>\"\")), $AE$4:$DZ$4),\"\")","v":""},{"$f":"IFERROR(LOOKUP(1, 1/((COUNTIF(EC$3:EC14, $AE$16:$DZ$16)=0)*($AE$16:$DZ$16<>\"\")), $AE$16:$DZ$16),\"\")","v":""},{"$f":"IFERROR(LOOKUP(1, 1/((COUNTIF(ED$3:ED14, $AE$28:$DZ$28)=0)*($AE$28:$DZ$28<>\"\")), $AE$28:$DZ$28),\"\")","v":""},{"$f":"IFERROR(LOOKUP(1, 1/((COUNTIF(EE$3:EE14, $AE$40:$DZ$40)=0)*($AE$40:$DZ$40<>\"\")), $AE$40:$DZ$40),\"\")","v":""},{"$f":"IFERROR(LOOKUP(1, 1/((COUNTIF(EF$3:EF14, $AE$52:$DZ$52)=0)*($AE$52:$DZ$52<>\"\")), $AE$52:$DZ$52),\"\")","v":""}]
[null,"Results calculation logic",null,null,null,null,null,null,null,null,null,null,null,null,null,null,null,null,null,null,null,null,null,null,null,null,13,5.2,null,null,null,null,null,null,null,null,null,null,null,null,null,null,null,null,null,null,null,null,null,null,null,null,null,null,null,null,null,null,null,null,null,null,null,null,null,null,null,null,null,null,null,null,null,null,null,null,null,null,null,null,null,null,null,null,null,null,null,null,null,null,null,null,null,null,null,null,null,null,null,null,null,null,null,null,null,null,null,null,null,null,null,null,null,null,null,null,null,null,null,null,null,null,null,null,null,null,null,null,null,null,13,{"$f":"IFERROR(LOOKUP(1, 1/((COUNTIF(EB$3:EB15, $AE$4:$DZ$4)=0)*($AE$4:$DZ$4<>\"\")), $AE$4:$DZ$4),\"\")","v":""},{"$f":"IFERROR(LOOKUP(1, 1/((COUNTIF(EC$3:EC15, $AE$16:$DZ$16)=0)*($AE$16:$DZ$16<>\"\")), $AE$16:$DZ$16),\"\")","v":""},{"$f":"IFERROR(LOOKUP(1, 1/((COUNTIF(ED$3:ED15, $AE$28:$DZ$28)=0)*($AE$28:$DZ$28<>\"\")), $AE$28:$DZ$28),\"\")","v":""},{"$f":"IFERROR(LOOKUP(1, 1/((COUNTIF(EE$3:EE15, $AE$40:$DZ$40)=0)*($AE$40:$DZ$40<>\"\")), $AE$40:$DZ$40),\"\")","v":""},{"$f":"IFERROR(LOOKUP(1, 1/((COUNTIF(EF$3:EF15, $AE$52:$DZ$52)=0)*($AE$52:$DZ$52<>\"\")), $AE$52:$DZ$52),\"\")","v":""}]
[null,null,null,null,null,null,null,null,null,null,null,null,null,null,null,null,null,null,null,null,null,null,null,null,null,null,14,null,null,null,null,null,null,null,null,null,null,null,null,null,null,null,null,null,null,null,null,null,null,null,null,null,null,null,null,null,null,null,null,null,null,null,null,null,null,null,null,null,null,null,null,null,null,null,null,null,null,null,null,null,null,null,null,null,null,null,null,null,null,null,null,null,null,null,null,null,null,null,null,null,null,null,null,null,null,null,null,null,null,null,null,null,null,null,null,null,null,null,null,null,null,null,null,null,null,null,null,null,null,null,14,{"$f":"IFERROR(LOOKUP(1, 1/((COUNTIF(EB$3:EB16, $AE$4:$DZ$4)=0)*($AE$4:$DZ$4<>\"\")), $AE$4:$DZ$4),\"\")","v":""},{"$f":"IFERROR(LOOKUP(1, 1/((COUNTIF(EC$3:EC16, $AE$16:$DZ$16)=0)*($AE$16:$DZ$16<>\"\")), $AE$16:$DZ$16),\"\")","v":""},{"$f":"IFERROR(LOOKUP(1, 1/((COUNTIF(ED$3:ED16, $AE$28:$DZ$28)=0)*($AE$28:$DZ$28<>\"\")), $AE$28:$DZ$28),\"\")","v":""},{"$f":"IFERROR(LOOKUP(1, 1/((COUNTIF(EE$3:EE16, $AE$40:$DZ$40)=0)*($AE$40:$DZ$40<>\"\")), $AE$40:$DZ$40),\"\")","v":""},{"$f":"IFERROR(LOOKUP(1, 1/((COUNTIF(EF$3:EF16, $AE$52:$DZ$52)=0)*($AE$52:$DZ$52<>\"\")), $AE$52:$DZ$52),\"\")","v":""}]
[null,"Criteria",null,"Subcriteria",null,"Related test sections for scoring",null,null,null,null,null,"Related test sections for weighting",null,null,null,"Scoring calc.","Weighting calc.","Scoring ME","Scoring notes","Weighting notes",null,null,null,null,"result (min)",null,15,null,null,null,null,null,null,null,null,null,null,null,null,null,null,null,null,null,null,null,null,null,null,null,null,null,null,null,null,null,null,null,null,null,null,null,null,null,null,null,null,null,null,null,null,null,null,null,null,null,null,null,null,null,null,null,null,null,null,null,null,null,null,null,null,null,null,null,null,null,null,null,null,null,null,null,null,null,null,null,null,null,null,null,null,null,null,null,null,null,null,null,null,null,null,null,null,null,null,null,null,null,null,null,15,{"$f":"IFERROR(LOOKUP(1, 1/((COUNTIF(EB$3:EB17, $AE$4:$DZ$4)=0)*($AE$4:$DZ$4<>\"\")), $AE$4:$DZ$4),\"\")","v":""},{"$f":"IFERROR(LOOKUP(1, 1/((COUNTIF(EC$3:EC17, $AE$16:$DZ$16)=0)*($AE$16:$DZ$16<>\"\")), $AE$16:$DZ$16),\"\")","v":""},{"$f":"IFERROR(LOOKUP(1, 1/((COUNTIF(ED$3:ED17, $AE$28:$DZ$28)=0)*($AE$28:$DZ$28<>\"\")), $AE$28:$DZ$28),\"\")","v":""},{"$f":"IFERROR(LOOKUP(1, 1/((COUNTIF(EE$3:EE17, $AE$40:$DZ$40)=0)*($AE$40:$DZ$40<>\"\")), $AE$40:$DZ$40),\"\")","v":""},{"$f":"IFERROR(LOOKUP(1, 1/((COUNTIF(EF$3:EF17, $AE$52:$DZ$52)=0)*($AE$52:$DZ$52<>\"\")), $AE$52:$DZ$52),\"\")","v":""}]
[null,"I.",{"$f":"VLOOKUP(B19,'Results and Analysis'!$C$26:$D$31,2,FALSE)","v":"Fuel cost and convenience"},{"$f":"IF('Results and Analysis'!C38<>0,'Results and Analysis'!C38,\"\")","v":"A."},{"$f":"'Results and Analysis'!D38","v":"Fuel availability"},"4.5 A",null,null,null,null,null,"4.5 B",4.5999999999999996,null,null,{"$f":"IFERROR(IF(Y19=0,4,IF(Y19<W19,3,IF(Y19<=X19,2,IF(Y19>X19,1)))),\"N/A\")","v":"N/A"},{"$f":"IFERROR(IF(VLOOKUP(M19,'results compilation'!$A$2:$C$500,2,FALSE)>0,AVERAGE(VLOOKUP(L19,'results compilation'!$A$2:$C$500,2,FALSE),VLOOKUP(M19,'results compilation'!$A$2:$C$500,2,FALSE)),VLOOKUP(L19,'results compilation'!$A$2:$C$500,2,FALSE)),\"N/A\")","v":"N/A"},{"$f":"IFERROR(VLOOKUP(F19,'results compilation'!$A$2:$C$500,3,FALSE)/VLOOKUP(F19,'results compilation'!$A$2:$C$500,2,FALSE),\"N/A\")","v":"N/A"},"criteria at right",null,null,null,15,60,{"$f":"VLOOKUP(F19,'results compilation'!$A$2:$C$500,2,FALSE)*1440","v":{"$error":"#VALUE!"}},null,16,null,null,null,null,null,null,null,null,null,null,null,null,null,null,null,null,null,null,null,null,null,null,null,null,null,null,null,null,null,null,null,null,null,null,null,null,null,null,null,null,null,null,null,null,null,null,null,null,null,null,null,null,null,null,null,null,null,null,null,null,null,null,null,null,null,null,null,null,null,null,null,null,null,null,null,null,null,null,null,null,null,null,null,null,null,null,null,null,null,null,null,null,null,null,null,null,null,null,null,null,null,null,null,16,{"$f":"IFERROR(LOOKUP(1, 1/((COUNTIF(EB$3:EB18, $AE$4:$DZ$4)=0)*($AE$4:$DZ$4<>\"\")), $AE$4:$DZ$4),\"\")","v":""},{"$f":"IFERROR(LOOKUP(1, 1/((COUNTIF(EC$3:EC18, $AE$16:$DZ$16)=0)*($AE$16:$DZ$16<>\"\")), $AE$16:$DZ$16),\"\")","v":""},{"$f":"IFERROR(LOOKUP(1, 1/((COUNTIF(ED$3:ED18, $AE$28:$DZ$28)=0)*($AE$28:$DZ$28<>\"\")), $AE$28:$DZ$28),\"\")","v":""},{"$f":"IFERROR(LOOKUP(1, 1/((COUNTIF(EE$3:EE18, $AE$40:$DZ$40)=0)*($AE$40:$DZ$40<>\"\")), $AE$40:$DZ$40),\"\")","v":""},{"$f":"IFERROR(LOOKUP(1, 1/((COUNTIF(EF$3:EF18, $AE$52:$DZ$52)=0)*($AE$52:$DZ$52<>\"\")), $AE$52:$DZ$52),\"\")","v":""}]
[null,null,null,{"$f":"IF('Results and Analysis'!C39<>0,'Results and Analysis'!C39,\"\")","v":"B."},{"$f":"'Results and Analysis'!D39","v":"Fuel preparation time (reported)"},"4.7 A",null,null,null,null,null,"4.7 B",null,null,null,{"$f":"IFERROR(IF(Y20=0,4,IF(Y20<V20,3,IF(Y20<=W20,2,IF(Y20>X20,1,0)))),\"N/A\")","v":"N/A"},{"$f":"VLOOKUP(L20,'results compilation'!$A$2:$C$500,2,FALSE)","v":"N/A"},{"$f":"IFERROR(VLOOKUP(F20,'results compilation'!$A$2:$C$500,3,FALSE)/VLOOKUP(F20,'results compilation'!$A$2:$C$500,2,FALSE),\"N/A\")","v":"N/A"},"criteria at right","average, unless 4.6 is N/A, then 4.5 only",null,2,5,15,{"$f":"VLOOKUP(F20,'results compilation'!$A$2:$C$500,2,FALSE)*1440","v":{"$error":"#VALUE!"}},null,17,null,null,null,null,null,null,null,null,null,null,null,null,null,null,null,null,null,null,null,null,null,null,null,null,null,null,null,null,null,null,null,null,null,null,null,null,null,null,null,null,null,null,null,null,null,null,null,null,null,null,null,null,null,null,null,null,null,null,null,null,null,null,null,null,null,null,null,null,null,null,null,null,null,null,null,null,null,null,null,null,null,null,null,null,null,null,null,null,null,null,null,null,null,null,null,null,null,null,null,null,null,null,null,17,{"$f":"IFERROR(LOOKUP(1, 1/((COUNTIF(EB$3:EB19, $AE$4:$DZ$4)=0)*($AE$4:$DZ$4<>\"\")), $AE$4:$DZ$4),\"\")","v":""},{"$f":"IFERROR(LOOKUP(1, 1/((COUNTIF(EC$3:EC19, $AE$16:$DZ$16)=0)*($AE$16:$DZ$16<>\"\")), $AE$16:$DZ$16),\"\")","v":""},{"$f":"IFERROR(LOOKUP(1, 1/((COUNTIF(ED$3:ED19, $AE$28:$DZ$28)=0)*($AE$28:$DZ$28<>\"\")), $AE$28:$DZ$28),\"\")","v":""},{"$f":"IFERROR(LOOKUP(1, 1/((COUNTIF(EE$3:EE19, $AE$40:$DZ$40)=0)*($AE$40:$DZ$40<>\"\")), $AE$40:$DZ$40),\"\")","v":""},{"$f":"IFERROR(LOOKUP(1, 1/((COUNTIF(EF$3:EF19, $AE$52:$DZ$52)=0)*($AE$52:$DZ$52<>\"\")), $AE$52:$DZ$52),\"\")","v":""}]
[null,null,null,{"$f":"IF('Results and Analysis'!C40<>0,'Results and Analysis'!C40,\"\")","v":""},{"$f":"'Results and Analysis'!D40","v":"Fuel preparation time (measured)"},3.1,"3.1b",null,null,null,null,null,null,null,null,{"$f":"IFERROR(VLOOKUP(G21,'results compilation'!$A$2:$C$500,2,FALSE)-VLOOKUP(F21,'results compilation'!$A$2:$C$500,2,FALSE),\"N/A\")","v":"N/A"},null,{"$f":"IFERROR(AVERAGE(VLOOKUP(F21,'results compilation'!$A$2:$C$500,3,FALSE),VLOOKUP(G21,'results compilation'!$A$2:$C$500,3,FALSE)),\"N/A\")","v":"N/A"},"minutes",null,null,null,null,null,null,null,18,null,null,null,null,null,null,null,null,null,null,null,null,null,null,null,null,null,null,null,null,null,null,null,null,null,null,null,null,null,null,null,null,null,null,null,null,null,null,null,null,null,null,null,null,null,null,null,null,null,null,null,null,null,null,null,null,null,null,null,null,null,null,null,null,null,null,null,null,null,null,null,null,null,null,null,null,null,null,null,null,null,null,null,null,null,null,null,null,null,null,null,null,null,null,null,null,null,null,null,null,null,null,null,18,{"$f":"IFERROR(LOOKUP(1, 1/((COUNTIF(EB$3:EB20, $AE$4:$DZ$4)=0)*($AE$4:$DZ$4<>\"\")), $AE$4:$DZ$4),\"\")","v":""},{"$f":"IFERROR(LOOKUP(1, 1/((COUNTIF(EC$3:EC20, $AE$16:$DZ$16)=0)*($AE$16:$DZ$16<>\"\")), $AE$16:$DZ$16),\"\")","v":""},{"$f":"IFERROR(LOOKUP(1, 1/((COUNTIF(ED$3:ED20, $AE$28:$DZ$28)=0)*($AE$28:$DZ$28<>\"\")), $AE$28:$DZ$28),\"\")","v":""},{"$f":"IFERROR(LOOKUP(1, 1/((COUNTIF(EE$3:EE20, $AE$40:$DZ$40)=0)*($AE$40:$DZ$40<>\"\")), $AE$40:$DZ$40),\"\")","v":""},{"$f":"IFERROR(LOOKUP(1, 1/((COUNTIF(EF$3:EF20, $AE$52:$DZ$52)=0)*($AE$52:$DZ$52<>\"\")), $AE$52:$DZ$52),\"\")","v":""}]
[null,null,null,{"$f":"IF('Results and Analysis'!C41<>0,'Results and Analysis'!C41,\"\")","v":""},{"$f":"'Results and Analysis'!D41","v":"Special knowledge/tools needed"},"3.1c",null,null,null,null,null,null,null,null,null,{"$f":"VLOOKUP(F22,'results compilation'!$A$2:$C$500,2,FALSE)","v":"N/A"},null,{"$f":"VLOOKUP(G21,'results compilation'!$A$2:$C$500,3,FALSE)","v":"N/A"},"% yes",null,null,null,null,null,null,null,19,null,null,null,null,null,null,null,null,null,null,null,null,null,null,null,null,null,null,null,null,null,null,null,null,null,null,null,null,null,null,null,null,null,null,null,null,null,null,null,null,null,null,null,null,null,null,null,null,null,null,null,null,null,null,null,null,null,null,null,null,null,null,null,null,null,null,null,null,null,null,null,null,null,null,null,null,null,null,null,null,null,null,null,null,null,null,null,null,null,null,null,null,null,null,null,null,null,null,null,null,null,null,null,19,{"$f":"IFERROR(LOOKUP(1, 1/((COUNTIF(EB$3:EB21, $AE$4:$DZ$4)=0)*($AE$4:$DZ$4<>\"\")), $AE$4:$DZ$4),\"\")","v":""},{"$f":"IFERROR(LOOKUP(1, 1/((COUNTIF(EC$3:EC21, $AE$16:$DZ$16)=0)*($AE$16:$DZ$16<>\"\")), $AE$16:$DZ$16),\"\")","v":""},{"$f":"IFERROR(LOOKUP(1, 1/((COUNTIF(ED$3:ED21, $AE$28:$DZ$28)=0)*($AE$28:$DZ$28<>\"\")), $AE$28:$DZ$28),\"\")","v":""},{"$f":"IFERROR(LOOKUP(1, 1/((COUNTIF(EE$3:EE21, $AE$40:$DZ$40)=0)*($AE$40:$DZ$40<>\"\")), $AE$40:$DZ$40),\"\")","v":""},{"$f":"IFERROR(LOOKUP(1, 1/((COUNTIF(EF$3:EF21, $AE$52:$DZ$52)=0)*($AE$52:$DZ$52<>\"\")), $AE$52:$DZ$52),\"\")","v":""}]
[null,null,null,{"$f":"IF('Results and Analysis'!C42<>0,'Results and Analysis'!C42,\"\")","v":"C."},{"$f":"'Results and Analysis'!D42","v":"Fuel cost (% of income - self reported)"},4.2,4.4000000000000004,"annual income",null,null,null,null,null,null,null,{"$f":"IFERROR(((365/VLOOKUP(F23,'results compilation'!$A$2:$C$500,2,FALSE))*VLOOKUP(G23,'results compilation'!$A$2:$C$500,2,FALSE))/'Results and Analysis'!F19,\"N/A\")","v":"N/A"},null,{"$f":"IFERROR(365/AVERAGE(VLOOKUP(F23,'results compilation'!$A$2:$C$500,3,FALSE),VLOOKUP(G23,'results compilation'!$A$2:$C$500,3,FALSE)),\"N/A\")","v":"N/A"},null,null,null,null,null,null,null,null,20,null,null,null,null,null,null,null,null,null,null,null,null,null,null,null,null,null,null,null,null,null,null,null,null,null,null,null,null,null,null,null,null,null,null,null,null,null,null,null,null,null,null,null,null,null,null,null,null,null,null,null,null,null,null,null,null,null,null,null,null,null,null,null,null,null,null,null,null,null,null,null,null,null,null,null,null,null,null,null,null,null,null,null,null,null,null,null,null,null,null,null,null,null,null,null,null,null,null,null,null,null,null,null,20,{"$f":"IFERROR(LOOKUP(1, 1/((COUNTIF(EB$3:EB22, $AE$4:$DZ$4)=0)*($AE$4:$DZ$4<>\"\")), $AE$4:$DZ$4),\"\")","v":""},{"$f":"IFERROR(LOOKUP(1, 1/((COUNTIF(EC$3:EC22, $AE$16:$DZ$16)=0)*($AE$16:$DZ$16<>\"\")), $AE$16:$DZ$16),\"\")","v":""},{"$f":"IFERROR(LOOKUP(1, 1/((COUNTIF(ED$3:ED22, $AE$28:$DZ$28)=0)*($AE$28:$DZ$28<>\"\")), $AE$28:$DZ$28),\"\")","v":""},{"$f":"IFERROR(LOOKUP(1, 1/((COUNTIF(EE$3:EE22, $AE$40:$DZ$40)=0)*($AE$40:$DZ$40<>\"\")), $AE$40:$DZ$40),\"\")","v":""},{"$f":"IFERROR(LOOKUP(1, 1/((COUNTIF(EF$3:EF22, $AE$52:$DZ$52)=0)*($AE$52:$DZ$52<>\"\")), $AE$52:$DZ$52),\"\")","v":""}]
[null,null,null,{"$f":"IF('Results and Analysis'!C43<>0,'Results and Analysis'!C43,\"\")","v":""},{"$f":"'Results and Analysis'!D43","v":"Fuel cost (% of income - outside estimate)"},3.3,4.0999999999999996,"annual income","fuel cost",null,null,null,null,null,null,{"$f":"IFERROR((365*'Results and Analysis'!F21*VLOOKUP(F24,'results compilation'!$A$2:$C$500,2,FALSE)*VLOOKUP(G24,'results compilation'!$A$2:$C$500,2,FALSE))/'Results and Analysis'!F19,\"N/A\")","v":"N/A"},null,null,null,null,null,null,null,null,null,null,21]
[null,null,null,{"$f":"IF('Results and Analysis'!C44<>0,'Results and Analysis'!C44,\"\")","v":""},null,null,null,null,null,null,null,null,null,null,null,null,null,null,null,null,null,null,null,null,null,null,22,null,null,null,null,null,null,null,null,null,null,null,null,null,null,null,null,null,null,null,null,null,null,null,null,null,null,null,null,null,null,null,null,null,null,null,null,null,null,null,null,null,null,null,null,null,null,null,null,null,null,null,null,null,null,null,null,null,null,null,null,null,null,null,null,null,null,null,null,null,null,null,null,null,null,null,null,null,null,null,null,null,null,null,null,null,null,null,null,null,null,null,null,null,null,null,null,null,null,null,null,null,null,null,21,{"$f":"IFERROR(LOOKUP(1, 1/((COUNTIF(EB$24:EB24, $AE$7:$DZ$7)=0)*($AE$7:$DZ$7<>\"\")), $AE$7:$DZ$7),\"\")","v":""},{"$f":"IFERROR(LOOKUP(1, 1/((COUNTIF(EC$24:EC24, $AE$19:$DZ$19)=0)*($AE$19:$DZ$19<>\"\")), $AE$19:$DZ$19),\"\")","v":""},{"$f":"IFERROR(LOOKUP(1, 1/((COUNTIF(ED$24:ED24, $AE$31:$DZ$31)=0)*($AE$31:$DZ$31<>\"\")), $AE$31:$DZ$31),\"\")","v":""},{"$f":"IFERROR(LOOKUP(1, 1/((COUNTIF(EE$24:EE24, $AE$43:$DZ$43)=0)*($AE$43:$DZ$43<>\"\")), $AE$43:$DZ$43),\"\")","v":""},{"$f":"IFERROR(LOOKUP(1, 1/((COUNTIF(EF$24:EF24, $AE$55:$DZ$55)=0)*($AE$55:$DZ$55<>\"\")), $AE$55:$DZ$55),\"\")","v":""}]
[null,"II.",{"$f":"VLOOKUP(B26,'Results and Analysis'!$C$26:$D$31,2,FALSE)","v":"Cooking performance"},{"$f":"IF('Results and Analysis'!C51<>0,'Results and Analysis'!C51,\"\")","v":"A."},{"$f":"'Results and Analysis'!D51","v":"Cooking speed (percieved)"},"4.11 A",null,null,null,null,null,"4.11 b",null,null,null,{"$f":"VLOOKUP(F26,'results compilation'!$A$2:$C$500,2,FALSE)","v":"N/A"},{"$f":"VLOOKUP(L26,'results compilation'!$A$2:$C$500,2,FALSE)","v":"N/A"},{"$f":"VLOOKUP(F26,'results compilation'!$A$2:$C$500,3,FALSE)","v":"N/A"},null,null,null,null,null,null,null,null,23,null,null,null,null,null,null,null,null,null,null,null,null,null,null,null,null,null,null,null,null,null,null,null,null,null,null,null,null,null,null,null,null,null,null,null,null,null,null,null,null,null,null,null,null,null,null,null,null,null,null,null,null,null,null,null,null,null,null,null,null,null,null,null,null,null,null,null,null,null,null,null,null,null,null,null,null,null,null,null,null,null,null,null,null,null,null,null,null,null,null,null,null,null,null,null,null,null,null,null,null,null,null,null,22,{"$f":"IFERROR(LOOKUP(1, 1/((COUNTIF(EB$24:EB25, $AE$7:$DZ$7)=0)*($AE$7:$DZ$7<>\"\")), $AE$7:$DZ$7),\"\")","v":""},{"$f":"IFERROR(LOOKUP(1, 1/((COUNTIF(EC$24:EC25, $AE$19:$DZ$19)=0)*($AE$19:$DZ$19<>\"\")), $AE$19:$DZ$19),\"\")","v":""},{"$f":"IFERROR(LOOKUP(1, 1/((COUNTIF(ED$24:ED25, $AE$31:$DZ$31)=0)*($AE$31:$DZ$31<>\"\")), $AE$31:$DZ$31),\"\")","v":""},{"$f":"IFERROR(LOOKUP(1, 1/((COUNTIF(EE$24:EE25, $AE$43:$DZ$43)=0)*($AE$43:$DZ$43<>\"\")), $AE$43:$DZ$43),\"\")","v":""},{"$f":"IFERROR(LOOKUP(1, 1/((COUNTIF(EF$24:EF25, $AE$55:$DZ$55)=0)*($AE$55:$DZ$55<>\"\")), $AE$55:$DZ$55),\"\")","v":""}]
[null,null,null,{"$f":"IF('Results and Analysis'!C52<>0,'Results and Analysis'!C52,\"\")","v":""},{"$f":"'Results and Analysis'!D52","v":"Cooking duration (measured)"},3.4,null,null,null,null,null,null,null,null,null,{"$f":"IF(VLOOKUP(F27,'results compilation'!$A$2:$C$500,2,FALSE)=0,\"N/A\",VLOOKUP(F27,'results compilation'!$A$2:$C$500,2,FALSE))","v":"N/A"},null,{"$f":"IF(VLOOKUP(F27,'results compilation'!$A$2:$C$500,3,FALSE)=0,\"N/A\",VLOOKUP(F27,'results compilation'!$A$2:$C$500,3,FALSE))","v":"N/A"},null,null,null,null,null,null,null,null,24,null,null,null,null,null,null,null,null,null,null,null,null,null,null,null,null,null,null,null,null,null,null,null,null,null,null,null,null,null,null,null,null,null,null,null,null,null,null,null,null,null,null,null,null,null,null,null,null,null,null,null,null,null,null,null,null,null,null,null,null,null,null,null,null,null,null,null,null,null,null,null,null,null,null,null,null,null,null,null,null,null,null,null,null,null,null,null,null,null,null,null,null,null,null,null,null,null,null,null,null,null,null,null,23,{"$f":"IFERROR(LOOKUP(1, 1/((COUNTIF(EB$24:EB26, $AE$7:$DZ$7)=0)*($AE$7:$DZ$7<>\"\")), $AE$7:$DZ$7),\"\")","v":""},{"$f":"IFERROR(LOOKUP(1, 1/((COUNTIF(EC$24:EC26, $AE$19:$DZ$19)=0)*($AE$19:$DZ$19<>\"\")), $AE$19:$DZ$19),\"\")","v":""},{"$f":"IFERROR(LOOKUP(1, 1/((COUNTIF(ED$24:ED26, $AE$31:$DZ$31)=0)*($AE$31:$DZ$31<>\"\")), $AE$31:$DZ$31),\"\")","v":""},{"$f":"IFERROR(LOOKUP(1, 1/((COUNTIF(EE$24:EE26, $AE$43:$DZ$43)=0)*($AE$43:$DZ$43<>\"\")), $AE$43:$DZ$43),\"\")","v":""},{"$f":"IFERROR(LOOKUP(1, 1/((COUNTIF(EF$24:EF26, $AE$55:$DZ$55)=0)*($AE$55:$DZ$55<>\"\")), $AE$55:$DZ$55),\"\")","v":""}]
[null,null,null,{"$f":"IF('Results and Analysis'!C53<>0,'Results and Analysis'!C53,\"\")","v":"B."},{"$f":"'Results and Analysis'!D53","v":"Firepower control"},"4.9 A",null,null,null,null,null,"4.9 b",null,null,null,{"$f":"VLOOKUP(F28,'results compilation'!$A$2:$C$500,2,FALSE)","v":"N/A"},{"$f":"VLOOKUP(L28,'results compilation'!$A$2:$C$500,2,FALSE)","v":"N/A"},{"$f":"VLOOKUP(F28,'results compilation'!$A$2:$C$500,3,FALSE)","v":"N/A"},null,null,null,null,null,null,null,null,25,5.3,null,null,null,null,null,null,null,null,null,null,null,null,null,null,null,null,null,null,null,null,null,null,null,null,null,null,null,null,null,null,null,null,null,null,null,null,null,null,null,null,null,null,null,null,null,null,null,null,null,null,null,null,null,null,null,null,null,null,null,null,null,null,null,null,null,null,null,null,null,null,null,null,null,null,null,null,null,null,null,null,null,null,null,null,null,null,null,null,null,null,null,null,null,null,null,null,null,null,null,null,null,null,24,{"$f":"IFERROR(LOOKUP(1, 1/((COUNTIF(EB$24:EB27, $AE$7:$DZ$7)=0)*($AE$7:$DZ$7<>\"\")), $AE$7:$DZ$7),\"\")","v":""},{"$f":"IFERROR(LOOKUP(1, 1/((COUNTIF(EC$24:EC27, $AE$19:$DZ$19)=0)*($AE$19:$DZ$19<>\"\")), $AE$19:$DZ$19),\"\")","v":""},{"$f":"IFERROR(LOOKUP(1, 1/((COUNTIF(ED$24:ED27, $AE$31:$DZ$31)=0)*($AE$31:$DZ$31<>\"\")), $AE$31:$DZ$31),\"\")","v":""},{"$f":"IFERROR(LOOKUP(1, 1/((COUNTIF(EE$24:EE27, $AE$43:$DZ$43)=0)*($AE$43:$DZ$43<>\"\")), $AE$43:$DZ$43),\"\")","v":""},{"$f":"IFERROR(LOOKUP(1, 1/((COUNTIF(EF$24:EF27, $AE$55:$DZ$55)=0)*($AE$55:$DZ$55<>\"\")), $AE$55:$DZ$55),\"\")","v":""}]
[null,null,null,{"$f":"IF('Results and Analysis'!C54<>0,'Results and Analysis'!C54,\"\")","v":"C."},{"$f":"'Results and Analysis'!D54","v":"Firepower range"},"4.8 A",null,null,null,null,null,"4.8 b",null,null,null,{"$f":"VLOOKUP(F29,'results compilation'!$A$2:$C$500,2,FALSE)","v":"N/A"},{"$f":"VLOOKUP(L29,'results compilation'!$A$2:$C$500,2,FALSE)","v":"N/A"},{"$f":"VLOOKUP(F29,'results compilation'!$A$2:$C$500,3,FALSE)","v":"N/A"},null,null,null,null,null,null,null,null,26,null,null,null,null,null,null,null,null,null,null,null,null,null,null,null,null,null,null,null,null,null,null,null,null,null,null,null,null,null,null,null,null,null,null,null,null,null,null,null,null,null,null,null,null,null,null,null,null,null,null,null,null,null,null,null,null,null,null,null,null,null,null,null,null,null,null,null,null,null,null,null,null,null,null,null,null,null,null,null,null,null,null,null,null,null,null,null,null,null,null,null,null,null,null,null,null,null,null,null,null,null,null,null,25,{"$f":"IFERROR(LOOKUP(1, 1/((COUNTIF(EB$24:EB28, $AE$7:$DZ$7)=0)*($AE$7:$DZ$7<>\"\")), $AE$7:$DZ$7),\"\")","v":""},{"$f":"IFERROR(LOOKUP(1, 1/((COUNTIF(EC$24:EC28, $AE$19:$DZ$19)=0)*($AE$19:$DZ$19<>\"\")), $AE$19:$DZ$19),\"\")","v":""},{"$f":"IFERROR(LOOKUP(1, 1/((COUNTIF(ED$24:ED28, $AE$31:$DZ$31)=0)*($AE$31:$DZ$31<>\"\")), $AE$31:$DZ$31),\"\")","v":""},{"$f":"IFERROR(LOOKUP(1, 1/((COUNTIF(EE$24:EE28, $AE$43:$DZ$43)=0)*($AE$43:$DZ$43<>\"\")), $AE$43:$DZ$43),\"\")","v":""},{"$f":"IFERROR(LOOKUP(1, 1/((COUNTIF(EF$24:EF28, $AE$55:$DZ$55)=0)*($AE$55:$DZ$55<>\"\")), $AE$55:$DZ$55),\"\")","v":""}]
[null,null,null,{"$f":"IF('Results and Analysis'!C55<>0,'Results and Analysis'!C55,\"\")","v":"D."},{"$f":"'Results and Analysis'!D55","v":"Use of all pots and pans"},"4.12 A",null,null,null,null,null,"4.12 B",null,null,null,{"$f":"VLOOKUP(F30,'results compilation'!$A$2:$C$500,2,FALSE)","v":"N/A"},{"$f":"VLOOKUP(L30,'results compilation'!$A$2:$C$500,2,FALSE)","v":"N/A"},{"$f":"VLOOKUP(F30,'results compilation'!$A$2:$C$500,3,FALSE)","v":"N/A"},null,null,null,null,null,null,null,null,27,null,null,null,null,null,null,null,null,null,null,null,null,null,null,null,null,null,null,null,null,null,null,null,null,null,null,null,null,null,null,null,null,null,null,null,null,null,null,null,null,null,null,null,null,null,null,null,null,null,null,null,null,null,null,null,null,null,null,null,null,null,null,null,null,null,null,null,null,null,null,null,null,null,null,null,null,null,null,null,null,null,null,null,null,null,null,null,null,null,null,null,null,null,null,null,null,null,null,null,null,null,null,null,26,{"$f":"IFERROR(LOOKUP(1, 1/((COUNTIF(EB$24:EB29, $AE$7:$DZ$7)=0)*($AE$7:$DZ$7<>\"\")), $AE$7:$DZ$7),\"\")","v":""},{"$f":"IFERROR(LOOKUP(1, 1/((COUNTIF(EC$24:EC29, $AE$19:$DZ$19)=0)*($AE$19:$DZ$19<>\"\")), $AE$19:$DZ$19),\"\")","v":""},{"$f":"IFERROR(LOOKUP(1, 1/((COUNTIF(ED$24:ED29, $AE$31:$DZ$31)=0)*($AE$31:$DZ$31<>\"\")), $AE$31:$DZ$31),\"\")","v":""},{"$f":"IFERROR(LOOKUP(1, 1/((COUNTIF(EE$24:EE29, $AE$43:$DZ$43)=0)*($AE$43:$DZ$43<>\"\")), $AE$43:$DZ$43),\"\")","v":""},{"$f":"IFERROR(LOOKUP(1, 1/((COUNTIF(EF$24:EF29, $AE$55:$DZ$55)=0)*($AE$55:$DZ$55<>\"\")), $AE$55:$DZ$55),\"\")","v":""}]
[null,null,null,null,"(not used)",4.13,2.4,null,null,null,null,null,null,null,null,{"$f":"IFERROR(VLOOKUP(F31,'results compilation'!$A$2:$C$500,2,FALSE)/VLOOKUP(G31,'results compilation'!$A$2:$C$500,2,FALSE),\"N/A\")","v":"N/A"},null,null,null,null,null,null,null,null,null,null,28,null,null,null,null,null,null,null,null,null,null,null,null,null,null,null,null,null,null,null,null,null,null,null,null,null,null,null,null,null,null,null,null,null,null,null,null,null,null,null,null,null,null,null,null,null,null,null,null,null,null,null,null,null,null,null,null,null,null,null,null,null,null,null,null,null,null,null,null,null,null,null,null,null,null,null,null,null,null,null,null,null,null,null,null,null,null,null,null,null,null,null,null,null,null,null,null,null,null,null,null,null,null,null,27,{"$f":"IFERROR(LOOKUP(1, 1/((COUNTIF(EB$24:EB30, $AE$7:$DZ$7)=0)*($AE$7:$DZ$7<>\"\")), $AE$7:$DZ$7),\"\")","v":""},{"$f":"IFERROR(LOOKUP(1, 1/((COUNTIF(EC$24:EC30, $AE$19:$DZ$19)=0)*($AE$19:$DZ$19<>\"\")), $AE$19:$DZ$19),\"\")","v":""},{"$f":"IFERROR(LOOKUP(1, 1/((COUNTIF(ED$24:ED30, $AE$31:$DZ$31)=0)*($AE$31:$DZ$31<>\"\")), $AE$31:$DZ$31),\"\")","v":""},{"$f":"IFERROR(LOOKUP(1, 1/((COUNTIF(EE$24:EE30, $AE$43:$DZ$43)=0)*($AE$43:$DZ$43<>\"\")), $AE$43:$DZ$43),\"\")","v":""},{"$f":"IFERROR(LOOKUP(1, 1/((COUNTIF(EF$24:EF30, $AE$55:$DZ$55)=0)*($AE$55:$DZ$55<>\"\")), $AE$55:$DZ$55),\"\")","v":""}]
[null,null,null,{"$f":"IF('Results and Analysis'!C56<>0,'Results and Analysis'!C56,\"\")","v":""},null,null,null,null,null,null,null,null,null,null,null,null,null,null,null,null,null,null,null,null,"result (cm^2)",null,29,null,null,null,null,null,null,null,null,null,null,null,null,null,null,null,null,null,null,null,null,null,null,null,null,null,null,null,null,null,null,null,null,null,null,null,null,null,null,null,null,null,null,null,null,null,null,null,null,null,null,null,null,null,null,null,null,null,null,null,null,null,null,null,null,null,null,null,null,null,null,null,null,null,null,null,null,null,null,null,null,null,null,null,null,null,null,null,null,null,null,null,null,null,null,null,null,null,null,null,null,null,null,null,28,{"$f":"IFERROR(LOOKUP(1, 1/((COUNTIF(EB$24:EB31, $AE$7:$DZ$7)=0)*($AE$7:$DZ$7<>\"\")), $AE$7:$DZ$7),\"\")","v":""},{"$f":"IFERROR(LOOKUP(1, 1/((COUNTIF(EC$24:EC31, $AE$19:$DZ$19)=0)*($AE$19:$DZ$19<>\"\")), $AE$19:$DZ$19),\"\")","v":""},{"$f":"IFERROR(LOOKUP(1, 1/((COUNTIF(ED$24:ED31, $AE$31:$DZ$31)=0)*($AE$31:$DZ$31<>\"\")), $AE$31:$DZ$31),\"\")","v":""},{"$f":"IFERROR(LOOKUP(1, 1/((COUNTIF(EE$24:EE31, $AE$43:$DZ$43)=0)*($AE$43:$DZ$43<>\"\")), $AE$43:$DZ$43),\"\")","v":""},{"$f":"IFERROR(LOOKUP(1, 1/((COUNTIF(EF$24:EF31, $AE$55:$DZ$55)=0)*($AE$55:$DZ$55<>\"\")), $AE$55:$DZ$55),\"\")","v":""}]
[null,"III.",{"$f":"VLOOKUP(B33,'Results and Analysis'!$C$26:$D$31,2,FALSE)","v":"Operability"},{"$f":"IF('Results and Analysis'!C63<>0,'Results and Analysis'!C63,\"\")","v":"A."},{"$f":"'Results and Analysis'!D63","v":"Fuel feed entry size"},2.2000000000000002,null,null,null,null,null,null,null,null,null,{"$f":"IF(Y33=\"N/A\",\"N/A\",IF(Y33=1,4,IF(Y33>U33,4,IF(Y33>=V33,3,IF(Y33>=W33,2,IF(Y33>=X33,1,0))))))","v":"N/A"},4,{"$f":"VLOOKUP(F33,'results compilation'!$A$2:$C$500,3,FALSE)","v":"N/A"},"criteria cutoffs given at right",null,600,300,150,75,{"$f":"VLOOKUP(F33,'results compilation'!$A$2:$C$500,2,FALSE)","v":"N/A"},null,30,null,null,null,null,null,null,null,null,null,null,null,null,null,null,null,null,null,null,null,null,null,null,null,null,null,null,null,null,null,null,null,null,null,null,null,null,null,null,null,null,null,null,null,null,null,null,null,null,null,null,null,null,null,null,null,null,null,null,null,null,null,null,null,null,null,null,null,null,null,null,null,null,null,null,null,null,null,null,null,null,null,null,null,null,null,null,null,null,null,null,null,null,null,null,null,null,null,null,null,null,null,null,null,29,{"$f":"IFERROR(LOOKUP(1, 1/((COUNTIF(EB$24:EB32, $AE$7:$DZ$7)=0)*($AE$7:$DZ$7<>\"\")), $AE$7:$DZ$7),\"\")","v":""},{"$f":"IFERROR(LOOKUP(1, 1/((COUNTIF(EC$24:EC32, $AE$19:$DZ$19)=0)*($AE$19:$DZ$19<>\"\")), $AE$19:$DZ$19),\"\")","v":""},{"$f":"IFERROR(LOOKUP(1, 1/((COUNTIF(ED$24:ED32, $AE$31:$DZ$31)=0)*($AE$31:$DZ$31<>\"\")), $AE$31:$DZ$31),\"\")","v":""},{"$f":"IFERROR(LOOKUP(1, 1/((COUNTIF(EE$24:EE32, $AE$43:$DZ$43)=0)*($AE$43:$DZ$43<>\"\")), $AE$43:$DZ$43),\"\")","v":""},{"$f":"IFERROR(LOOKUP(1, 1/((COUNTIF(EF$24:EF32, $AE$55:$DZ$55)=0)*($AE$55:$DZ$55<>\"\")), $AE$55:$DZ$55),\"\")","v":""}]
[null,null,null,{"$f":"IF('Results and Analysis'!C64<>0,'Results and Analysis'!C64,\"\")","v":"B."},{"$f":"'Results and Analysis'!D64","v":"Tending frequency (percieved)"},"4.10 A",null,null,null,null,null,"4.10 b",null,null,null,{"$f":"VLOOKUP(F34,'results compilation'!$A$2:$C$500,2,FALSE)","v":"N/A"},{"$f":"VLOOKUP(L34,'results compilation'!$A$2:$C$500,2,FALSE)","v":"N/A"},{"$f":"VLOOKUP(F34,'results compilation'!$A$2:$C$500,3,FALSE)","v":"N/A"},null,null,null,null,null,null,null,null,31,null,null,null,null,null,null,null,null,null,null,null,null,null,null,null,null,null,null,null,null,null,null,null,null,null,null,null,null,null,null,null,null,null,null,null,null,null,null,null,null,null,null,null,null,null,null,null,null,null,null,null,null,null,null,null,null,null,null,null,null,null,null,null,null,null,null,null,null,null,null,null,null,null,null,null,null,null,null,null,null,null,null,null,null,null,null,null,null,null,null,null,null,null,null,null,null,null,null,null,null,null,null,null,30,{"$f":"IFERROR(LOOKUP(1, 1/((COUNTIF(EB$24:EB33, $AE$7:$DZ$7)=0)*($AE$7:$DZ$7<>\"\")), $AE$7:$DZ$7),\"\")","v":""},{"$f":"IFERROR(LOOKUP(1, 1/((COUNTIF(EC$24:EC33, $AE$19:$DZ$19)=0)*($AE$19:$DZ$19<>\"\")), $AE$19:$DZ$19),\"\")","v":""},{"$f":"IFERROR(LOOKUP(1, 1/((COUNTIF(ED$24:ED33, $AE$31:$DZ$31)=0)*($AE$31:$DZ$31<>\"\")), $AE$31:$DZ$31),\"\")","v":""},{"$f":"IFERROR(LOOKUP(1, 1/((COUNTIF(EE$24:EE33, $AE$43:$DZ$43)=0)*($AE$43:$DZ$43<>\"\")), $AE$43:$DZ$43),\"\")","v":""},{"$f":"IFERROR(LOOKUP(1, 1/((COUNTIF(EF$24:EF33, $AE$55:$DZ$55)=0)*($AE$55:$DZ$55<>\"\")), $AE$55:$DZ$55),\"\")","v":""}]
[null,null,null,{"$f":"IF('Results and Analysis'!C65<>0,'Results and Analysis'!C65,\"\")","v":""},{"$f":"'Results and Analysis'!D65","v":"Tending frequency (measured)"},3.5,null,null,null,null,null,null,null,null,null,{"$f":"VLOOKUP(F35,'results compilation'!$A$2:$C$500,2,FALSE)/1440","v":{"$error":"#VALUE!"}},null,{"$f":"VLOOKUP(F35,'results compilation'!$A$2:$C$500,3,FALSE)","v":"N/A"},"minutes",null,null,null,null,null,null,null,32,null,null,null,null,null,null,null,null,null,null,null,null,null,null,null,null,null,null,null,null,null,null,null,null,null,null,null,null,null,null,null,null,null,null,null,null,null,null,null,null,null,null,null,null,null,null,null,null,null,null,null,null,null,null,null,null,null,null,null,null,null,null,null,null,null,null,null,null,null,null,null,null,null,null,null,null,null,null,null,null,null,null,null,null,null,null,null,null,null,null,null,null,null,null,null,null,null,null,null,null,null,null,null,31,{"$f":"IFERROR(LOOKUP(1, 1/((COUNTIF(EB$24:EB34, $AE$7:$DZ$7)=0)*($AE$7:$DZ$7<>\"\")), $AE$7:$DZ$7),\"\")","v":""},{"$f":"IFERROR(LOOKUP(1, 1/((COUNTIF(EC$24:EC34, $AE$19:$DZ$19)=0)*($AE$19:$DZ$19<>\"\")), $AE$19:$DZ$19),\"\")","v":""},{"$f":"IFERROR(LOOKUP(1, 1/((COUNTIF(ED$24:ED34, $AE$31:$DZ$31)=0)*($AE$31:$DZ$31<>\"\")), $AE$31:$DZ$31),\"\")","v":""},{"$f":"IFERROR(LOOKUP(1, 1/((COUNTIF(EE$24:EE34, $AE$43:$DZ$43)=0)*($AE$43:$DZ$43<>\"\")), $AE$43:$DZ$43),\"\")","v":""},{"$f":"IFERROR(LOOKUP(1, 1/((COUNTIF(EF$24:EF34, $AE$55:$DZ$55)=0)*($AE$55:$DZ$55<>\"\")), $AE$55:$DZ$55),\"\")","v":""}]
[null,null,null,{"$f":"IF('Results and Analysis'!C66<>0,'Results and Analysis'!C66,\"\")","v":""},{"$f":"'Results and Analysis'!D66","v":"Fuel reloading frequency (measured)"},"3.5b",null,null,null,null,null,null,null,null,null,{"$f":"VLOOKUP(F36,'results compilation'!$A$2:$C$500,2,FALSE)/1440","v":{"$error":"#VALUE!"}},null,{"$f":"VLOOKUP(F36,'results compilation'!$A$2:$C$500,3,FALSE)","v":"N/A"},"minutes",null,null,null,null,null,null,null,33,null,null,null,null,null,null,null,null,null,null,null,null,null,null,null,null,null,null,null,null,null,null,null,null,null,null,null,null,null,null,null,null,null,null,null,null,null,null,null,null,null,null,null,null,null,null,null,null,null,null,null,null,null,null,null,null,null,null,null,null,null,null,null,null,null,null,null,null,null,null,null,null,null,null,null,null,null,null,null,null,null,null,null,null,null,null,null,null,null,null,null,null,null,null,null,null,null,null,null,null,null,null,null,32,{"$f":"IFERROR(LOOKUP(1, 1/((COUNTIF(EB$24:EB35, $AE$7:$DZ$7)=0)*($AE$7:$DZ$7<>\"\")), $AE$7:$DZ$7),\"\")","v":""},{"$f":"IFERROR(LOOKUP(1, 1/((COUNTIF(EC$24:EC35, $AE$19:$DZ$19)=0)*($AE$19:$DZ$19<>\"\")), $AE$19:$DZ$19),\"\")","v":""},{"$f":"IFERROR(LOOKUP(1, 1/((COUNTIF(ED$24:ED35, $AE$31:$DZ$31)=0)*($AE$31:$DZ$31<>\"\")), $AE$31:$DZ$31),\"\")","v":""},{"$f":"IFERROR(LOOKUP(1, 1/((COUNTIF(EE$24:EE35, $AE$43:$DZ$43)=0)*($AE$43:$DZ$43<>\"\")), $AE$43:$DZ$43),\"\")","v":""},{"$f":"IFERROR(LOOKUP(1, 1/((COUNTIF(EF$24:EF35, $AE$55:$DZ$55)=0)*($AE$55:$DZ$55<>\"\")), $AE$55:$DZ$55),\"\")","v":""}]
[null,null,null,{"$f":"IF('Results and Analysis'!C67<>0,'Results and Analysis'!C67,\"\")","v":"C."},{"$f":"'Results and Analysis'!D67","v":"Tending/refueling effort (percieved)"},"4.14 A",null,null,null,null,null,"4.14 B",null,null,null,{"$f":"IFERROR(VLOOKUP(F37,'results compilation'!$A$2:$C$500,2,FALSE)*4/3,\"N/A\")","v":"N/A"},{"$f":"VLOOKUP(L37,'results compilation'!$A$2:$C$500,2,FALSE)","v":"N/A"},{"$f":"VLOOKUP(F37,'results compilation'!$A$2:$C$500,3,FALSE)","v":"N/A"},"scaled by 1.33",null,null,null,null,null,null,null,34,null,null,null,null,null,null,null,null,null,null,null,null,null,null,null,null,null,null,null,null,null,null,null,null,null,null,null,null,null,null,null,null,null,null,null,null,null,null,null,null,null,null,null,null,null,null,null,null,null,null,null,null,null,null,null,null,null,null,null,null,null,null,null,null,null,null,null,null,null,null,null,null,null,null,null,null,null,null,null,null,null,null,null,null,null,null,null,null,null,null,null,null,null,null,null,null,null,null,null,null,null,null,null,33,{"$f":"IFERROR(LOOKUP(1, 1/((COUNTIF(EB$24:EB36, $AE$7:$DZ$7)=0)*($AE$7:$DZ$7<>\"\")), $AE$7:$DZ$7),\"\")","v":""},{"$f":"IFERROR(LOOKUP(1, 1/((COUNTIF(EC$24:EC36, $AE$19:$DZ$19)=0)*($AE$19:$DZ$19<>\"\")), $AE$19:$DZ$19),\"\")","v":""},{"$f":"IFERROR(LOOKUP(1, 1/((COUNTIF(ED$24:ED36, $AE$31:$DZ$31)=0)*($AE$31:$DZ$31<>\"\")), $AE$31:$DZ$31),\"\")","v":""},{"$f":"IFERROR(LOOKUP(1, 1/((COUNTIF(EE$24:EE36, $AE$43:$DZ$43)=0)*($AE$43:$DZ$43<>\"\")), $AE$43:$DZ$43),\"\")","v":""},{"$f":"IFERROR(LOOKUP(1, 1/((COUNTIF(EF$24:EF36, $AE$55:$DZ$55)=0)*($AE$55:$DZ$55<>\"\")), $AE$55:$DZ$55),\"\")","v":""}]
[null,null,null,{"$f":"IF('Results and Analysis'!C68<>0,'Results and Analysis'!C68,\"\")","v":"D."},{"$f":"'Results and Analysis'!D68","v":"Visibility of fire"},3.7,null,null,null,null,null,null,null,null,null,{"$f":"IFERROR(VLOOKUP(F38,'results compilation'!$A$2:$C$500,2,FALSE)*1.25,\"N/A\")","v":"N/A"},4,{"$f":"VLOOKUP(F38,'results compilation'!$A$2:$C$500,3,FALSE)","v":"N/A"},"scaled by 1.25",null,null,null,null,null,"result (min)",null,35,null,null,null,null,null,null,null,null,null,null,null,null,null,null,null,null,null,null,null,null,null,null,null,null,null,null,null,null,null,null,null,null,null,null,null,null,null,null,null,null,null,null,null,null,null,null,null,null,null,null,null,null,null,null,null,null,null,null,null,null,null,null,null,null,null,null,null,null,null,null,null,null,null,null,null,null,null,null,null,null,null,null,null,null,null,null,null,null,null,null,null,null,null,null,null,null,null,null,null,null,null,null,null,34,{"$f":"IFERROR(LOOKUP(1, 1/((COUNTIF(EB$24:EB37, $AE$7:$DZ$7)=0)*($AE$7:$DZ$7<>\"\")), $AE$7:$DZ$7),\"\")","v":""},{"$f":"IFERROR(LOOKUP(1, 1/((COUNTIF(EC$24:EC37, $AE$19:$DZ$19)=0)*($AE$19:$DZ$19<>\"\")), $AE$19:$DZ$19),\"\")","v":""},{"$f":"IFERROR(LOOKUP(1, 1/((COUNTIF(ED$24:ED37, $AE$31:$DZ$31)=0)*($AE$31:$DZ$31<>\"\")), $AE$31:$DZ$31),\"\")","v":""},{"$f":"IFERROR(LOOKUP(1, 1/((COUNTIF(EE$24:EE37, $AE$43:$DZ$43)=0)*($AE$43:$DZ$43<>\"\")), $AE$43:$DZ$43),\"\")","v":""},{"$f":"IFERROR(LOOKUP(1, 1/((COUNTIF(EF$24:EF37, $AE$55:$DZ$55)=0)*($AE$55:$DZ$55<>\"\")), $AE$55:$DZ$55),\"\")","v":""}]
[null,null,null,{"$f":"IF('Results and Analysis'!C69<>0,'Results and Analysis'!C69,\"\")","v":"E."},{"$f":"'Results and Analysis'!D69","v":"Ease of lighting"},2.1,3.2,null,null,null,null,null,null,null,null,{"$f":"IFERROR(AVERAGE(VLOOKUP(F39,'results compilation'!$A$2:$C$500,2,FALSE),IF(Y39<W39,4,IF(Y39<X39,2,0))),\"N/A\")","v":"N/A"},4,{"$f":"VLOOKUP(F39,'results compilation'!$A$2:$C$500,3,FALSE)","v":"N/A"},"criteria at right for 3.2",null,null,null,0.5,3,{"$f":"VLOOKUP(G39,'results compilation'!$A$2:$C$500,2,FALSE)","v":"N/A"},null,36,null,null,null,null,null,null,null,null,null,null,null,null,null,null,null,null,null,null,null,null,null,null,null,null,null,null,null,null,null,null,null,null,null,null,null,null,null,null,null,null,null,null,null,null,null,null,null,null,null,null,null,null,null,null,null,null,null,null,null,null,null,null,null,null,null,null,null,null,null,null,null,null,null,null,null,null,null,null,null,null,null,null,null,null,null,null,null,null,null,null,null,null,null,null,null,null,null,null,null,null,null,null,null,35,{"$f":"IFERROR(LOOKUP(1, 1/((COUNTIF(EB$24:EB38, $AE$7:$DZ$7)=0)*($AE$7:$DZ$7<>\"\")), $AE$7:$DZ$7),\"\")","v":""},{"$f":"IFERROR(LOOKUP(1, 1/((COUNTIF(EC$24:EC38, $AE$19:$DZ$19)=0)*($AE$19:$DZ$19<>\"\")), $AE$19:$DZ$19),\"\")","v":""},{"$f":"IFERROR(LOOKUP(1, 1/((COUNTIF(ED$24:ED38, $AE$31:$DZ$31)=0)*($AE$31:$DZ$31<>\"\")), $AE$31:$DZ$31),\"\")","v":""},{"$f":"IFERROR(LOOKUP(1, 1/((COUNTIF(EE$24:EE38, $AE$43:$DZ$43)=0)*($AE$43:$DZ$43<>\"\")), $AE$43:$DZ$43),\"\")","v":""},{"$f":"IFERROR(LOOKUP(1, 1/((COUNTIF(EF$24:EF38, $AE$55:$DZ$55)=0)*($AE$55:$DZ$55<>\"\")), $AE$55:$DZ$55),\"\")","v":""}]
[null,null,null,{"$f":"IF('Results and Analysis'!C70<>0,'Results and Analysis'!C70,\"\")","v":"F."},{"$f":"'Results and Analysis'!D70","v":"Fire start-up delay"},"4.15 A",null,null,null,null,null,"4.15 b",null,null,null,{"$f":"VLOOKUP(F40,'results compilation'!$A$2:$C$500,2,FALSE)","v":"N/A"},{"$f":"VLOOKUP(L40,'results compilation'!$A$2:$C$500,2,FALSE)","v":"N/A"},{"$f":"IFERROR(VLOOKUP(F40,'results compilation'!$A$2:$C$500,3,FALSE),\"N/A\")","v":"N/A"},null,null,null,null,null,null,"result (total errors)",null,37,5.4,null,null,null,null,null,null,null,null,null,null,null,null,null,null,null,null,null,null,null,null,null,null,null,null,null,null,null,null,null,null,null,null,null,null,null,null,null,null,null,null,null,null,null,null,null,null,null,null,null,null,null,null,null,null,null,null,null,null,null,null,null,null,null,null,null,null,null,null,null,null,null,null,null,null,null,null,null,null,null,null,null,null,null,null,null,null,null,null,null,null,null,null,null,null,null,null,null,null,null,null,null,null,36,{"$f":"IFERROR(LOOKUP(1, 1/((COUNTIF(EB$24:EB39, $AE$7:$DZ$7)=0)*($AE$7:$DZ$7<>\"\")), $AE$7:$DZ$7),\"\")","v":""},{"$f":"IFERROR(LOOKUP(1, 1/((COUNTIF(EC$24:EC39, $AE$19:$DZ$19)=0)*($AE$19:$DZ$19<>\"\")), $AE$19:$DZ$19),\"\")","v":""},{"$f":"IFERROR(LOOKUP(1, 1/((COUNTIF(ED$24:ED39, $AE$31:$DZ$31)=0)*($AE$31:$DZ$31<>\"\")), $AE$31:$DZ$31),\"\")","v":""},{"$f":"IFERROR(LOOKUP(1, 1/((COUNTIF(EE$24:EE39, $AE$43:$DZ$43)=0)*($AE$43:$DZ$43<>\"\")), $AE$43:$DZ$43),\"\")","v":""},{"$f":"IFERROR(LOOKUP(1, 1/((COUNTIF(EF$24:EF39, $AE$55:$DZ$55)=0)*($AE$55:$DZ$55<>\"\")), $AE$55:$DZ$55),\"\")","v":""}]
[null,null,null,{"$f":"IF('Results and Analysis'!C71<>0,'Results and Analysis'!C71,\"\")","v":"G."},{"$f":"'Results and Analysis'!D71","v":"User error"},3.6,null,null,null,null,null,null,null,null,null,{"$f":"IF(Y41=\"N/A\",\"N/A\",IF(Y41=0,4,IF(Y41<V41,3,IF(Y41<W41,2,IF(Y41<X41,1,0)))))","v":"N/A"},4,{"$f":"IFERROR(VLOOKUP(F41,'results compilation'!$A$2:$C$500,3,FALSE),\"N/A\")","v":"N/A"},"criteria at right",null,1,3,10,20,{"$f":"VLOOKUP(F41,'results compilation'!$A$2:$C$500,2,FALSE)","v":"N/A"},null,38,null,null,null,null,null,null,null,null,null,null,null,null,null,null,null,null,null,null,null,null,null,null,null,null,null,null,null,null,null,null,null,null,null,null,null,null,null,null,null,null,null,null,null,null,null,null,null,null,null,null,null,null,null,null,null,null,null,null,null,null,null,null,null,null,null,null,null,null,null,null,null,null,null,null,null,null,null,null,null,null,null,null,null,null,null,null,null,null,null,null,null,null,null,null,null,null,null,null,null,null,null,null,null,37,{"$f":"IFERROR(LOOKUP(1, 1/((COUNTIF(EB$24:EB40, $AE$7:$DZ$7)=0)*($AE$7:$DZ$7<>\"\")), $AE$7:$DZ$7),\"\")","v":""},{"$f":"IFERROR(LOOKUP(1, 1/((COUNTIF(EC$24:EC40, $AE$19:$DZ$19)=0)*($AE$19:$DZ$19<>\"\")), $AE$19:$DZ$19),\"\")","v":""},{"$f":"IFERROR(LOOKUP(1, 1/((COUNTIF(ED$24:ED40, $AE$31:$DZ$31)=0)*($AE$31:$DZ$31<>\"\")), $AE$31:$DZ$31),\"\")","v":""},{"$f":"IFERROR(LOOKUP(1, 1/((COUNTIF(EE$24:EE40, $AE$43:$DZ$43)=0)*($AE$43:$DZ$43<>\"\")), $AE$43:$DZ$43),\"\")","v":""},{"$f":"IFERROR(LOOKUP(1, 1/((COUNTIF(EF$24:EF40, $AE$55:$DZ$55)=0)*($AE$55:$DZ$55<>\"\")), $AE$55:$DZ$55),\"\")","v":""}]
[null,null,null,{"$f":"IF('Results and Analysis'!C72<>0,'Results and Analysis'!C72,\"\")","v":"H."},{"$f":"'Results and Analysis'!D72","v":"User instruction"},4.2699999999999996,null,null,null,null,null,null,null,null,null,{"$f":"VLOOKUP(F42,'results compilation'!$A$2:$C$500,2,FALSE)","v":"N/A"},4,{"$f":"VLOOKUP(F42,'results compilation'!$A$2:$C$500,3,FALSE)","v":"N/A"},null,null,null,null,null,null,null,null,39,null,null,null,null,null,null,null,null,null,null,null,null,null,null,null,null,null,null,null,null,null,null,null,null,null,null,null,null,null,null,null,null,null,null,null,null,null,null,null,null,null,null,null,null,null,null,null,null,null,null,null,null,null,null,null,null,null,null,null,null,null,null,null,null,null,null,null,null,null,null,null,null,null,null,null,null,null,null,null,null,null,null,null,null,null,null,null,null,null,null,null,null,null,null,null,null,null,null,null,null,null,null,null,38,{"$f":"IFERROR(LOOKUP(1, 1/((COUNTIF(EB$24:EB41, $AE$7:$DZ$7)=0)*($AE$7:$DZ$7<>\"\")), $AE$7:$DZ$7),\"\")","v":""},{"$f":"IFERROR(LOOKUP(1, 1/((COUNTIF(EC$24:EC41, $AE$19:$DZ$19)=0)*($AE$19:$DZ$19<>\"\")), $AE$19:$DZ$19),\"\")","v":""},{"$f":"IFERROR(LOOKUP(1, 1/((COUNTIF(ED$24:ED41, $AE$31:$DZ$31)=0)*($AE$31:$DZ$31<>\"\")), $AE$31:$DZ$31),\"\")","v":""},{"$f":"IFERROR(LOOKUP(1, 1/((COUNTIF(EE$24:EE41, $AE$43:$DZ$43)=0)*($AE$43:$DZ$43<>\"\")), $AE$43:$DZ$43),\"\")","v":""},{"$f":"IFERROR(LOOKUP(1, 1/((COUNTIF(EF$24:EF41, $AE$55:$DZ$55)=0)*($AE$55:$DZ$55<>\"\")), $AE$55:$DZ$55),\"\")","v":""}]
[null,null,null,{"$f":"IF('Results and Analysis'!C73<>0,'Results and Analysis'!C73,\"\")","v":""},null,null,null,null,null,null,null,null,null,null,null,null,null,null,null,null,null,null,null,null,"result (times/yr)",null,40,null,null,null,null,null,null,null,null,null,null,null,null,null,null,null,null,null,null,null,null,null,null,null,null,null,null,null,null,null,null,null,null,null,null,null,null,null,null,null,null,null,null,null,null,null,null,null,null,null,null,null,null,null,null,null,null,null,null,null,null,null,null,null,null,null,null,null,null,null,null,null,null,null,null,null,null,null,null,null,null,null,null,null,null,null,null,null,null,null,null,null,null,null,null,null,null,null,null,null,null,null,null,null,39,{"$f":"IFERROR(LOOKUP(1, 1/((COUNTIF(EB$24:EB42, $AE$7:$DZ$7)=0)*($AE$7:$DZ$7<>\"\")), $AE$7:$DZ$7),\"\")","v":""},{"$f":"IFERROR(LOOKUP(1, 1/((COUNTIF(EC$24:EC42, $AE$19:$DZ$19)=0)*($AE$19:$DZ$19<>\"\")), $AE$19:$DZ$19),\"\")","v":""},{"$f":"IFERROR(LOOKUP(1, 1/((COUNTIF(ED$24:ED42, $AE$31:$DZ$31)=0)*($AE$31:$DZ$31<>\"\")), $AE$31:$DZ$31),\"\")","v":""},{"$f":"IFERROR(LOOKUP(1, 1/((COUNTIF(EE$24:EE42, $AE$43:$DZ$43)=0)*($AE$43:$DZ$43<>\"\")), $AE$43:$DZ$43),\"\")","v":""},{"$f":"IFERROR(LOOKUP(1, 1/((COUNTIF(EF$24:EF42, $AE$55:$DZ$55)=0)*($AE$55:$DZ$55<>\"\")), $AE$55:$DZ$55),\"\")","v":""}]
[null,"IV.",{"$f":"VLOOKUP(B44,'Results and Analysis'!$C$26:$D$31,2,FALSE)","v":"Maintenance"},{"$f":"IF('Results and Analysis'!C80<>0,'Results and Analysis'!C80,\"\")","v":"A."},{"$f":"'Results and Analysis'!D80","v":"Routine maintenance"},"4.16 A",null,null,null,null,null,"4.16 b",null,null,null,{"$f":"IF(Y44=\"N/A\",\"N/A\",IF(Y44<0.01,4,IF(Y44<V44,3,IF(Y44<W44,2,IF(Y44<X44,1,0)))))","v":"N/A"},{"$f":"VLOOKUP(L44,'results compilation'!$A$2:$C$500,2,FALSE)","v":"N/A"},{"$f":"IFERROR(VLOOKUP(F44,'results compilation'!$A$2:$C$500,3,FALSE)/VLOOKUP(F44,'results compilation'!$A$2:$C$500,2,FALSE),\"N/A\")","v":"N/A"},"criteria at right",null,null,1,3,6,{"$f":"IFERROR(365/VLOOKUP(F44,'results compilation'!$A$2:$C$500,2,FALSE),\"N/A\")","v":"N/A"},null,41,null,null,null,null,null,null,null,null,null,null,null,null,null,null,null,null,null,null,null,null,null,null,null,null,null,null,null,null,null,null,null,null,null,null,null,null,null,null,null,null,null,null,null,null,null,null,null,null,null,null,null,null,null,null,null,null,null,null,null,null,null,null,null,null,null,null,null,null,null,null,null,null,null,null,null,null,null,null,null,null,null,null,null,null,null,null,null,null,null,null,null,null,null,null,null,null,null,null,null,null,null,null,null,40,{"$f":"IFERROR(LOOKUP(1, 1/((COUNTIF(EB$24:EB43, $AE$7:$DZ$7)=0)*($AE$7:$DZ$7<>\"\")), $AE$7:$DZ$7),\"\")","v":""},{"$f":"IFERROR(LOOKUP(1, 1/((COUNTIF(EC$24:EC43, $AE$19:$DZ$19)=0)*($AE$19:$DZ$19<>\"\")), $AE$19:$DZ$19),\"\")","v":""},{"$f":"IFERROR(LOOKUP(1, 1/((COUNTIF(ED$24:ED43, $AE$31:$DZ$31)=0)*($AE$31:$DZ$31<>\"\")), $AE$31:$DZ$31),\"\")","v":""},{"$f":"IFERROR(LOOKUP(1, 1/((COUNTIF(EE$24:EE43, $AE$43:$DZ$43)=0)*($AE$43:$DZ$43<>\"\")), $AE$43:$DZ$43),\"\")","v":""},{"$f":"IFERROR(LOOKUP(1, 1/((COUNTIF(EF$24:EF43, $AE$55:$DZ$55)=0)*($AE$55:$DZ$55<>\"\")), $AE$55:$DZ$55),\"\")","v":""}]
[null,null,null,{"$f":"IF('Results and Analysis'!C81<>0,'Results and Analysis'!C81,\"\")","v":"B."},{"$f":"'Results and Analysis'!D81","v":"Long-term maintenance"},"4.17 A",null,null,null,null,null,"4.17 b",null,null,null,{"$f":"IFERROR(VLOOKUP(F45,'results compilation'!$A$2:$C$500,2,FALSE)*4/3,\"N/A\")","v":"N/A"},{"$f":"VLOOKUP(L45,'results compilation'!$A$2:$C$500,2,FALSE)","v":"N/A"},{"$f":"IFERROR(VLOOKUP(F45,'results compilation'!$A$2:$C$500,3,FALSE),\"N/A\")","v":"N/A"},"scaled by 1.33",null,null,null,null,null,null,null,42]
[null,null,null,null,null,"4.17 Ab",null,null,null,null,null,null,null,null,null,{"$f":"VLOOKUP(F46,'results compilation'!$A$2:$C$500,2,FALSE)","v":0},null,null,null,null,null,null,null,null,null,null,43,null,null,null,null,null,null,null,null,null,null,null,null,null,null,null,null,null,null,null,null,null,null,null,null,null,null,null,null,null,null,null,null,null,null,null,null,null,null,null,null,null,null,null,null,null,null,null,null,null,null,null,null,null,null,null,null,null,null,null,null,null,null,null,null,null,null,null,null,null,null,null,null,null,null,null,null,null,null,null,null,null,null,null,null,null,null,null,null,null,null,null,null,null,null,null,null,null,null,null,null,null,null,null,41,{"$f":"IFERROR(LOOKUP(1, 1/((COUNTIF(EB$44:EB44, $AE$10:$DZ$10)=0)*($AE$10:$DZ$10<>\"\")), $AE$10:$DZ$10),\"\")","v":""},{"$f":"IFERROR(LOOKUP(1, 1/((COUNTIF(EC$44:EC44, $AE$22:$DZ$22)=0)*($AE$22:$DZ$22<>\"\")), $AE$22:$DZ$22),\"\")","v":""},{"$f":"IFERROR(LOOKUP(1, 1/((COUNTIF(ED$44:ED44, $AE$34:$DZ$34)=0)*($AE$34:$DZ$34<>\"\")), $AE$34:$DZ$34),\"\")","v":""},{"$f":"IFERROR(LOOKUP(1, 1/((COUNTIF(EE$44:EE44, $AE$46:$DZ$46)=0)*($AE$46:$DZ$46<>\"\")), $AE$46:$DZ$46),\"\")","v":""},{"$f":"IFERROR(LOOKUP(1, 1/((COUNTIF(EF$44:EF44, $AE$58:$DZ$58)=0)*($AE$58:$DZ$58<>\"\")), $AE$58:$DZ$58),\"\")","v":""}]
[null,null,null,null,{"$f":"'Results and Analysis'!D82","v":"Annual maintenance cost (% of income)"},"4.17 Ac",null,null,null,null,null,null,null,null,null,{"$f":"IFERROR(VLOOKUP(F47,'results compilation'!$A$2:$C$500,2,FALSE)/'Results and Analysis'!F19,\"N/A\")","v":"N/A"},null,{"$f":"IFERROR(VLOOKUP(F47,'results compilation'!$A$2:$C$500,3,FALSE)/'Results and Analysis'!F19,\"N/A\")","v":"N/A"},null,null,null,null,null,null,null,null,44,null,null,null,null,null,null,null,null,null,null,null,null,null,null,null,null,null,null,null,null,null,null,null,null,null,null,null,null,null,null,null,null,null,null,null,null,null,null,null,null,null,null,null,null,null,null,null,null,null,null,null,null,null,null,null,null,null,null,null,null,null,null,null,null,null,null,null,null,null,null,null,null,null,null,null,null,null,null,null,null,null,null,null,null,null,null,null,null,null,null,null,null,null,null,null,null,null,null,null,null,null,null,null,42,{"$f":"IFERROR(LOOKUP(1, 1/((COUNTIF(EB$44:EB46, $AE$10:$DZ$10)=0)*($AE$10:$DZ$10<>\"\")), $AE$10:$DZ$10),\"\")","v":""},{"$f":"IFERROR(LOOKUP(1, 1/((COUNTIF(EC$44:EC46, $AE$22:$DZ$22)=0)*($AE$22:$DZ$22<>\"\")), $AE$22:$DZ$22),\"\")","v":""},{"$f":"IFERROR(LOOKUP(1, 1/((COUNTIF(ED$44:ED46, $AE$34:$DZ$34)=0)*($AE$34:$DZ$34<>\"\")), $AE$34:$DZ$34),\"\")","v":""},{"$f":"IFERROR(LOOKUP(1, 1/((COUNTIF(EE$44:EE46, $AE$46:$DZ$46)=0)*($AE$46:$DZ$46<>\"\")), $AE$46:$DZ$46),\"\")","v":""},{"$f":"IFERROR(LOOKUP(1, 1/((COUNTIF(EF$44:EF46, $AE$58:$DZ$58)=0)*($AE$58:$DZ$58<>\"\")), $AE$58:$DZ$58),\"\")","v":""}]
[null,null,null,{"$f":"IF('Results and Analysis'!C76<>0,'Results and Analysis'!C76,\"\")","v":""},null,null,null,null,null,null,null,null,null,null,null,null,null,null,null,null,null,null,null,null,null,null,45,null,null,null,null,null,null,null,null,null,null,null,null,null,null,null,null,null,null,null,null,null,null,null,null,null,null,null,null,null,null,null,null,null,null,null,null,null,null,null,null,null,null,null,null,null,null,null,null,null,null,null,null,null,null,null,null,null,null,null,null,null,null,null,null,null,null,null,null,null,null,null,null,null,null,null,null,null,null,null,null,null,null,null,null,null,null,null,null,null,null,null,null,null,null,null,null,null,null,null,null,null,null,null,43,{"$f":"IFERROR(LOOKUP(1, 1/((COUNTIF(EB$44:EB47, $AE$10:$DZ$10)=0)*($AE$10:$DZ$10<>\"\")), $AE$10:$DZ$10),\"\")","v":""},{"$f":"IFERROR(LOOKUP(1, 1/((COUNTIF(EC$44:EC47, $AE$22:$DZ$22)=0)*($AE$22:$DZ$22<>\"\")), $AE$22:$DZ$22),\"\")","v":""},{"$f":"IFERROR(LOOKUP(1, 1/((COUNTIF(ED$44:ED47, $AE$34:$DZ$34)=0)*($AE$34:$DZ$34<>\"\")), $AE$34:$DZ$34),\"\")","v":""},{"$f":"IFERROR(LOOKUP(1, 1/((COUNTIF(EE$44:EE47, $AE$46:$DZ$46)=0)*($AE$46:$DZ$46<>\"\")), $AE$46:$DZ$46),\"\")","v":""},{"$f":"IFERROR(LOOKUP(1, 1/((COUNTIF(EF$44:EF47, $AE$58:$DZ$58)=0)*($AE$58:$DZ$58<>\"\")), $AE$58:$DZ$58),\"\")","v":""}]
[null,"V.",{"$f":"VLOOKUP(B49,'Results and Analysis'!$C$26:$D$31,2,FALSE)","v":"Comfort"},{"$f":"IF('Results and Analysis'!C90<>0,'Results and Analysis'!C90,\"\")","v":"A."},{"$f":"'Results and Analysis'!D90","v":"Perceived safety"},"4.18 A",null,null,null,null,null,"4.18 b",null,null,null,{"$f":"VLOOKUP(F49,'results compilation'!$A$2:$C$500,2,FALSE)","v":"N/A"},{"$f":"VLOOKUP(L49,'results compilation'!$A$2:$C$500,2,FALSE)","v":"N/A"},{"$f":"VLOOKUP(F49,'results compilation'!$A$2:$C$500,3,FALSE)","v":"N/A"},null,null,null,null,null,null,null,null,46,null,null,null,null,null,null,null,null,null,null,null,null,null,null,null,null,null,null,null,null,null,null,null,null,null,null,null,null,null,null,null,null,null,null,null,null,null,null,null,null,null,null,null,null,null,null,null,null,null,null,null,null,null,null,null,null,null,null,null,null,null,null,null,null,null,null,null,null,null,null,null,null,null,null,null,null,null,null,null,null,null,null,null,null,null,null,null,null,null,null,null,null,null,null,null,null,null,null,null,null,null,null,null,44,{"$f":"IFERROR(LOOKUP(1, 1/((COUNTIF(EB$44:EB48, $AE$10:$DZ$10)=0)*($AE$10:$DZ$10<>\"\")), $AE$10:$DZ$10),\"\")","v":""},{"$f":"IFERROR(LOOKUP(1, 1/((COUNTIF(EC$44:EC48, $AE$22:$DZ$22)=0)*($AE$22:$DZ$22<>\"\")), $AE$22:$DZ$22),\"\")","v":""},{"$f":"IFERROR(LOOKUP(1, 1/((COUNTIF(ED$44:ED48, $AE$34:$DZ$34)=0)*($AE$34:$DZ$34<>\"\")), $AE$34:$DZ$34),\"\")","v":""},{"$f":"IFERROR(LOOKUP(1, 1/((COUNTIF(EE$44:EE48, $AE$46:$DZ$46)=0)*($AE$46:$DZ$46<>\"\")), $AE$46:$DZ$46),\"\")","v":""},{"$f":"IFERROR(LOOKUP(1, 1/((COUNTIF(EF$44:EF48, $AE$58:$DZ$58)=0)*($AE$58:$DZ$58<>\"\")), $AE$58:$DZ$58),\"\")","v":""}]
[null,null,null,{"$f":"IF('Results and Analysis'!C91<>0,'Results and Analysis'!C91,\"\")","v":"B."},{"$f":"'Results and Analysis'!D91","v":"Perceived smoke exposure"},"4.19 A",null,null,null,null,null,"4.19 b",null,null,null,{"$f":"VLOOKUP(F50,'results compilation'!$A$2:$C$500,2,FALSE)","v":"N/A"},{"$f":"VLOOKUP(L50,'results compilation'!$A$2:$C$500,2,FALSE)","v":"N/A"},{"$f":"VLOOKUP(F50,'results compilation'!$A$2:$C$500,3,FALSE)","v":"N/A"},null,null,null,null,null,null,null,null,47,null,null,null,null,null,null,null,null,null,null,null,null,null,null,null,null,null,null,null,null,null,null,null,null,null,null,null,null,null,null,null,null,null,null,null,null,null,null,null,null,null,null,null,null,null,null,null,null,null,null,null,null,null,null,null,null,null,null,null,null,null,null,null,null,null,null,null,null,null,null,null,null,null,null,null,null,null,null,null,null,null,null,null,null,null,null,null,null,null,null,null,null,null,null,null,null,null,null,null,null,null,null,null,45,{"$f":"IFERROR(LOOKUP(1, 1/((COUNTIF(EB$44:EB49, $AE$10:$DZ$10)=0)*($AE$10:$DZ$10<>\"\")), $AE$10:$DZ$10),\"\")","v":""},{"$f":"IFERROR(LOOKUP(1, 1/((COUNTIF(EC$44:EC49, $AE$22:$DZ$22)=0)*($AE$22:$DZ$22<>\"\")), $AE$22:$DZ$22),\"\")","v":""},{"$f":"IFERROR(LOOKUP(1, 1/((COUNTIF(ED$44:ED49, $AE$34:$DZ$34)=0)*($AE$34:$DZ$34<>\"\")), $AE$34:$DZ$34),\"\")","v":""},{"$f":"IFERROR(LOOKUP(1, 1/((COUNTIF(EE$44:EE49, $AE$46:$DZ$46)=0)*($AE$46:$DZ$46<>\"\")), $AE$46:$DZ$46),\"\")","v":""},{"$f":"IFERROR(LOOKUP(1, 1/((COUNTIF(EF$44:EF49, $AE$58:$DZ$58)=0)*($AE$58:$DZ$58<>\"\")), $AE$58:$DZ$58),\"\")","v":""}]
[null,null,null,{"$f":"IF('Results and Analysis'!C92<>0,'Results and Analysis'!C92,\"\")","v":"C."},{"$f":"'Results and Analysis'!D92","v":"Cooking area soot deposits"},2.2999999999999998,null,null,null,null,null,null,null,null,null,{"$f":"IF(VLOOKUP(F51,'results compilation'!$A$2:$C$500,2,FALSE)=\"N/A\",\"N/A\",IF(VLOOKUP(F51,'results compilation'!$A$2:$C$500,2,FALSE)=2,4,0))","v":"N/A"},2,{"$f":"VLOOKUP(F51,'results compilation'!$A$2:$C$500,3,FALSE)","v":"N/A"},null,null,null,null,null,null,null,null,48,null,null,null,null,null,null,null,null,null,null,null,null,null,null,null,null,null,null,null,null,null,null,null,null,null,null,null,null,null,null,null,null,null,null,null,null,null,null,null,null,null,null,null,null,null,null,null,null,null,null,null,null,null,null,null,null,null,null,null,null,null,null,null,null,null,null,null,null,null,null,null,null,null,null,null,null,null,null,null,null,null,null,null,null,null,null,null,null,null,null,null,null,null,null,null,null,null,null,null,null,null,null,null,46,{"$f":"IFERROR(LOOKUP(1, 1/((COUNTIF(EB$44:EB50, $AE$10:$DZ$10)=0)*($AE$10:$DZ$10<>\"\")), $AE$10:$DZ$10),\"\")","v":""},{"$f":"IFERROR(LOOKUP(1, 1/((COUNTIF(EC$44:EC50, $AE$22:$DZ$22)=0)*($AE$22:$DZ$22<>\"\")), $AE$22:$DZ$22),\"\")","v":""},{"$f":"IFERROR(LOOKUP(1, 1/((COUNTIF(ED$44:ED50, $AE$34:$DZ$34)=0)*($AE$34:$DZ$34<>\"\")), $AE$34:$DZ$34),\"\")","v":""},{"$f":"IFERROR(LOOKUP(1, 1/((COUNTIF(EE$44:EE50, $AE$46:$DZ$46)=0)*($AE$46:$DZ$46<>\"\")), $AE$46:$DZ$46),\"\")","v":""},{"$f":"IFERROR(LOOKUP(1, 1/((COUNTIF(EF$44:EF50, $AE$58:$DZ$58)=0)*($AE$58:$DZ$58<>\"\")), $AE$58:$DZ$58),\"\")","v":""}]
[null,null,null,{"$f":"IF('Results and Analysis'!C93<>0,'Results and Analysis'!C93,\"\")","v":"D."},{"$f":"'Results and Analysis'!D93","v":"Pot soot deposits"},3.8,null,null,null,null,null,null,null,null,null,{"$f":"IFERROR(VLOOKUP(F52,'results compilation'!$A$2:$C$500,2,FALSE)*1.25,\"N/A\")","v":"N/A"},2,{"$f":"VLOOKUP(F52,'results compilation'!$A$2:$C$500,3,FALSE)","v":"N/A"},"scaled by 1.25",null,null,null,null,null,null,null,49,5.5,null,null,null,null,null,null,null,null,null,null,null,null,null,null,null,null,null,null,null,null,null,null,null,null,null,null,null,null,null,null,null,null,null,null,null,null,null,null,null,null,null,null,null,null,null,null,null,null,null,null,null,null,null,null,null,null,null,null,null,null,null,null,null,null,null,null,null,null,null,null,null,null,null,null,null,null,null,null,null,null,null,null,null,null,null,null,null,null,null,null,null,null,null,null,null,null,null,null,null,null,null,null,47,{"$f":"IFERROR(LOOKUP(1, 1/((COUNTIF(EB$44:EB51, $AE$10:$DZ$10)=0)*($AE$10:$DZ$10<>\"\")), $AE$10:$DZ$10),\"\")","v":""},{"$f":"IFERROR(LOOKUP(1, 1/((COUNTIF(EC$44:EC51, $AE$22:$DZ$22)=0)*($AE$22:$DZ$22<>\"\")), $AE$22:$DZ$22),\"\")","v":""},{"$f":"IFERROR(LOOKUP(1, 1/((COUNTIF(ED$44:ED51, $AE$34:$DZ$34)=0)*($AE$34:$DZ$34<>\"\")), $AE$34:$DZ$34),\"\")","v":""},{"$f":"IFERROR(LOOKUP(1, 1/((COUNTIF(EE$44:EE51, $AE$46:$DZ$46)=0)*($AE$46:$DZ$46<>\"\")), $AE$46:$DZ$46),\"\")","v":""},{"$f":"IFERROR(LOOKUP(1, 1/((COUNTIF(EF$44:EF51, $AE$58:$DZ$58)=0)*($AE$58:$DZ$58<>\"\")), $AE$58:$DZ$58),\"\")","v":""}]
[null,null,null,{"$f":"IF('Results and Analysis'!C94<>0,'Results and Analysis'!C94,\"\")","v":"E."},{"$f":"'Results and Analysis'!D94","v":"Cooking height"},"4.20 A",null,null,null,null,null,"4.20 b",null,null,null,{"$f":"VLOOKUP(F53,'results compilation'!$A$2:$C$500,2,FALSE)","v":"N/A"},{"$f":"VLOOKUP(L53,'results compilation'!$A$2:$C$500,2,FALSE)","v":"N/A"},{"$f":"VLOOKUP(F53,'results compilation'!$A$2:$C$500,3,FALSE)","v":"N/A"},null,null,null,null,null,null,null,null,50,null,null,null,null,null,null,null,null,null,null,null,null,null,null,null,null,null,null,null,null,null,null,null,null,null,null,null,null,null,null,null,null,null,null,null,null,null,null,null,null,null,null,null,null,null,null,null,null,null,null,null,null,null,null,null,null,null,null,null,null,null,null,null,null,null,null,null,null,null,null,null,null,null,null,null,null,null,null,null,null,null,null,null,null,null,null,null,null,null,null,null,null,null,null,null,null,null,null,null,null,null,null,null,48,{"$f":"IFERROR(LOOKUP(1, 1/((COUNTIF(EB$44:EB52, $AE$10:$DZ$10)=0)*($AE$10:$DZ$10<>\"\")), $AE$10:$DZ$10),\"\")","v":""},{"$f":"IFERROR(LOOKUP(1, 1/((COUNTIF(EC$44:EC52, $AE$22:$DZ$22)=0)*($AE$22:$DZ$22<>\"\")), $AE$22:$DZ$22),\"\")","v":""},{"$f":"IFERROR(LOOKUP(1, 1/((COUNTIF(ED$44:ED52, $AE$34:$DZ$34)=0)*($AE$34:$DZ$34<>\"\")), $AE$34:$DZ$34),\"\")","v":""},{"$f":"IFERROR(LOOKUP(1, 1/((COUNTIF(EE$44:EE52, $AE$46:$DZ$46)=0)*($AE$46:$DZ$46<>\"\")), $AE$46:$DZ$46),\"\")","v":""},{"$f":"IFERROR(LOOKUP(1, 1/((COUNTIF(EF$44:EF52, $AE$58:$DZ$58)=0)*($AE$58:$DZ$58<>\"\")), $AE$58:$DZ$58),\"\")","v":""}]
[null,null,null,{"$f":"IF('Results and Analysis'!C95<>0,'Results and Analysis'!C95,\"\")","v":"F."},{"$f":"'Results and Analysis'!D95","v":"Stove aesthetics"},"4.21 A",null,null,null,null,null,"4.21 b",null,null,null,{"$f":"VLOOKUP(F54,'results compilation'!$A$2:$C$500,2,FALSE)","v":"N/A"},{"$f":"VLOOKUP(L54,'results compilation'!$A$2:$C$500,2,FALSE)","v":"N/A"},{"$f":"VLOOKUP(F54,'results compilation'!$A$2:$C$500,3,FALSE)","v":"N/A"},null,null,null,null,null,null,null,null,51,null,null,null,null,null,null,null,null,null,null,null,null,null,null,null,null,null,null,null,null,null,null,null,null,null,null,null,null,null,null,null,null,null,null,null,null,null,null,null,null,null,null,null,null,null,null,null,null,null,null,null,null,null,null,null,null,null,null,null,null,null,null,null,null,null,null,null,null,null,null,null,null,null,null,null,null,null,null,null,null,null,null,null,null,null,null,null,null,null,null,null,null,null,null,null,null,null,null,null,null,null,null,null,49,{"$f":"IFERROR(LOOKUP(1, 1/((COUNTIF(EB$44:EB53, $AE$10:$DZ$10)=0)*($AE$10:$DZ$10<>\"\")), $AE$10:$DZ$10),\"\")","v":""},{"$f":"IFERROR(LOOKUP(1, 1/((COUNTIF(EC$44:EC53, $AE$22:$DZ$22)=0)*($AE$22:$DZ$22<>\"\")), $AE$22:$DZ$22),\"\")","v":""},{"$f":"IFERROR(LOOKUP(1, 1/((COUNTIF(ED$44:ED53, $AE$34:$DZ$34)=0)*($AE$34:$DZ$34<>\"\")), $AE$34:$DZ$34),\"\")","v":""},{"$f":"IFERROR(LOOKUP(1, 1/((COUNTIF(EE$44:EE53, $AE$46:$DZ$46)=0)*($AE$46:$DZ$46<>\"\")), $AE$46:$DZ$46),\"\")","v":""},{"$f":"IFERROR(LOOKUP(1, 1/((COUNTIF(EF$44:EF53, $AE$58:$DZ$58)=0)*($AE$58:$DZ$58<>\"\")), $AE$58:$DZ$58),\"\")","v":""}]
[null,null,null,{"$f":"IF('Results and Analysis'!C96<>0,'Results and Analysis'!C96,\"\")","v":"G."},{"$f":"'Results and Analysis'!D96","v":"Perceived durability"},"4.22 A",null,null,null,null,null,"4.22 b",null,null,null,{"$f":"VLOOKUP(F55,'results compilation'!$A$2:$C$500,2,FALSE)","v":"N/A"},{"$f":"VLOOKUP(L55,'results compilation'!$A$2:$C$500,2,FALSE)","v":"N/A"},{"$f":"VLOOKUP(F55,'results compilation'!$A$2:$C$500,3,FALSE)","v":"N/A"},null,null,null,null,null,null,null,null,52,null,null,null,null,null,null,null,null,null,null,null,null,null,null,null,null,null,null,null,null,null,null,null,null,null,null,null,null,null,null,null,null,null,null,null,null,null,null,null,null,null,null,null,null,null,null,null,null,null,null,null,null,null,null,null,null,null,null,null,null,null,null,null,null,null,null,null,null,null,null,null,null,null,null,null,null,null,null,null,null,null,null,null,null,null,null,null,null,null,null,null,null,null,null,null,null,null,null,null,null,null,null,null,50,{"$f":"IFERROR(LOOKUP(1, 1/((COUNTIF(EB$44:EB54, $AE$10:$DZ$10)=0)*($AE$10:$DZ$10<>\"\")), $AE$10:$DZ$10),\"\")","v":""},{"$f":"IFERROR(LOOKUP(1, 1/((COUNTIF(EC$44:EC54, $AE$22:$DZ$22)=0)*($AE$22:$DZ$22<>\"\")), $AE$22:$DZ$22),\"\")","v":""},{"$f":"IFERROR(LOOKUP(1, 1/((COUNTIF(ED$44:ED54, $AE$34:$DZ$34)=0)*($AE$34:$DZ$34<>\"\")), $AE$34:$DZ$34),\"\")","v":""},{"$f":"IFERROR(LOOKUP(1, 1/((COUNTIF(EE$44:EE54, $AE$46:$DZ$46)=0)*($AE$46:$DZ$46<>\"\")), $AE$46:$DZ$46),\"\")","v":""},{"$f":"IFERROR(LOOKUP(1, 1/((COUNTIF(EF$44:EF54, $AE$58:$DZ$58)=0)*($AE$58:$DZ$58<>\"\")), $AE$58:$DZ$58),\"\")","v":""}]
[null,null,null,{"$f":"IF('Results and Analysis'!C97<>0,'Results and Analysis'!C97,\"\")","v":"H."},{"$f":"'Results and Analysis'!D97","v":"Perceived value"},"4.23 A",null,null,null,null,null,"4.23 b",null,null,null,{"$f":"VLOOKUP(F56,'results compilation'!$A$2:$C$500,2,FALSE)","v":"N/A"},{"$f":"VLOOKUP(L56,'results compilation'!$A$2:$C$500,2,FALSE)","v":"N/A"},{"$f":"VLOOKUP(F56,'results compilation'!$A$2:$C$500,3,FALSE)","v":"N/A"},null,null,null,null,null,null,null,null,53,null,null,null,null,null,null,null,null,null,null,null,null,null,null,null,null,null,null,null,null,null,null,null,null,null,null,null,null,null,null,null,null,null,null,null,null,null,null,null,null,null,null,null,null,null,null,null,null,null,null,null,null,null,null,null,null,null,null,null,null,null,null,null,null,null,null,null,null,null,null,null,null,null,null,null,null,null,null,null,null,null,null,null,null,null,null,null,null,null,null,null,null,null,null,null,null,null,null,null,null,null,null,null,51,{"$f":"IFERROR(LOOKUP(1, 1/((COUNTIF(EB$44:EB55, $AE$10:$DZ$10)=0)*($AE$10:$DZ$10<>\"\")), $AE$10:$DZ$10),\"\")","v":""},{"$f":"IFERROR(LOOKUP(1, 1/((COUNTIF(EC$44:EC55, $AE$22:$DZ$22)=0)*($AE$22:$DZ$22<>\"\")), $AE$22:$DZ$22),\"\")","v":""},{"$f":"IFERROR(LOOKUP(1, 1/((COUNTIF(ED$44:ED55, $AE$34:$DZ$34)=0)*($AE$34:$DZ$34<>\"\")), $AE$34:$DZ$34),\"\")","v":""},{"$f":"IFERROR(LOOKUP(1, 1/((COUNTIF(EE$44:EE55, $AE$46:$DZ$46)=0)*($AE$46:$DZ$46<>\"\")), $AE$46:$DZ$46),\"\")","v":""},{"$f":"IFERROR(LOOKUP(1, 1/((COUNTIF(EF$44:EF55, $AE$58:$DZ$58)=0)*($AE$58:$DZ$58<>\"\")), $AE$58:$DZ$58),\"\")","v":""}]
[null,null,null,{"$f":"IF('Results and Analysis'!C98<>0,'Results and Analysis'!C98,\"\")","v":"I."},{"$f":"'Results and Analysis'!D98","v":"Taste"},"4.25 A",null,null,null,null,null,"4.25 b",null,null,null,{"$f":"VLOOKUP(F57,'results compilation'!$A$2:$C$500,2,FALSE)","v":"N/A"},{"$f":"VLOOKUP(L57,'results compilation'!$A$2:$C$500,2,FALSE)","v":"N/A"},{"$f":"VLOOKUP(F57,'results compilation'!$A$2:$C$500,3,FALSE)","v":"N/A"},null,null,null,null,null,null,null,null,54,null,null,null,null,null,null,null,null,null,null,null,null,null,null,null,null,null,null,null,null,null,null,null,null,null,null,null,null,null,null,null,null,null,null,null,null,null,null,null,null,null,null,null,null,null,null,null,null,null,null,null,null,null,null,null,null,null,null,null,null,null,null,null,null,null,null,null,null,null,null,null,null,null,null,null,null,null,null,null,null,null,null,null,null,null,null,null,null,null,null,null,null,null,null,null,null,null,null,null,null,null,null,null,52,{"$f":"IFERROR(LOOKUP(1, 1/((COUNTIF(EB$44:EB56, $AE$10:$DZ$10)=0)*($AE$10:$DZ$10<>\"\")), $AE$10:$DZ$10),\"\")","v":""},{"$f":"IFERROR(LOOKUP(1, 1/((COUNTIF(EC$44:EC56, $AE$22:$DZ$22)=0)*($AE$22:$DZ$22<>\"\")), $AE$22:$DZ$22),\"\")","v":""},{"$f":"IFERROR(LOOKUP(1, 1/((COUNTIF(ED$44:ED56, $AE$34:$DZ$34)=0)*($AE$34:$DZ$34<>\"\")), $AE$34:$DZ$34),\"\")","v":""},{"$f":"IFERROR(LOOKUP(1, 1/((COUNTIF(EE$44:EE56, $AE$46:$DZ$46)=0)*($AE$46:$DZ$46<>\"\")), $AE$46:$DZ$46),\"\")","v":""},{"$f":"IFERROR(LOOKUP(1, 1/((COUNTIF(EF$44:EF56, $AE$58:$DZ$58)=0)*($AE$58:$DZ$58<>\"\")), $AE$58:$DZ$58),\"\")","v":""}]
[null,null,null,{"$f":"IF('Results and Analysis'!C99<>0,'Results and Analysis'!C99,\"\")","v":""},null,null,null,null,null,null,null,null,null,null,null,"pass:","fail:",null,null,null,null,null,null,null,null,null,55,null,null,null,null,null,null,null,null,null,null,null,null,null,null,null,null,null,null,null,null,null,null,null,null,null,null,null,null,null,null,null,null,null,null,null,null,null,null,null,null,null,null,null,null,null,null,null,null,null,null,null,null,null,null,null,null,null,null,null,null,null,null,null,null,null,null,null,null,null,null,null,null,null,null,null,null,null,null,null,null,null,null,null,null,null,null,null,null,null,null,null,null,null,null,null,null,null,null,null,null,null,null,null,53,{"$f":"IFERROR(LOOKUP(1, 1/((COUNTIF(EB$44:EB57, $AE$10:$DZ$10)=0)*($AE$10:$DZ$10<>\"\")), $AE$10:$DZ$10),\"\")","v":""},{"$f":"IFERROR(LOOKUP(1, 1/((COUNTIF(EC$44:EC57, $AE$22:$DZ$22)=0)*($AE$22:$DZ$22<>\"\")), $AE$22:$DZ$22),\"\")","v":""},{"$f":"IFERROR(LOOKUP(1, 1/((COUNTIF(ED$44:ED57, $AE$34:$DZ$34)=0)*($AE$34:$DZ$34<>\"\")), $AE$34:$DZ$34),\"\")","v":""},{"$f":"IFERROR(LOOKUP(1, 1/((COUNTIF(EE$44:EE57, $AE$46:$DZ$46)=0)*($AE$46:$DZ$46<>\"\")), $AE$46:$DZ$46),\"\")","v":""},{"$f":"IFERROR(LOOKUP(1, 1/((COUNTIF(EF$44:EF57, $AE$58:$DZ$58)=0)*($AE$58:$DZ$58<>\"\")), $AE$58:$DZ$58),\"\")","v":""}]
[null,"VI.",{"$f":"VLOOKUP(B59,'Results and Analysis'!$C$26:$D$31,2,FALSE)","v":"Location-specific needs"},{"$f":"IF('Results and Analysis'!C106<>0,'Results and Analysis'!C106)","v":"A."},{"$f":"'Results and Analysis'!D106","v":"Space heating"},"4.24a",null,null,null,null,null,null,null,null,null,{"$f":"VLOOKUP(F59,'results compilation'!$A$2:$C$500,2,FALSE)","v":0},{"$f":"VLOOKUP(F59,'results compilation'!$A$2:$C$500,3,FALSE)","v":0},null,null,null,null,null,null,null,null,null,56,null,null,null,null,null,null,null,null,null,null,null,null,null,null,null,null,null,null,null,null,null,null,null,null,null,null,null,null,null,null,null,null,null,null,null,null,null,null,null,null,null,null,null,null,null,null,null,null,null,null,null,null,null,null,null,null,null,null,null,null,null,null,null,null,null,null,null,null,null,null,null,null,null,null,null,null,null,null,null,null,null,null,null,null,null,null,null,null,null,null,null,null,null,null,null,null,null,null,null,null,null,null,null,54,{"$f":"IFERROR(LOOKUP(1, 1/((COUNTIF(EB$44:EB58, $AE$10:$DZ$10)=0)*($AE$10:$DZ$10<>\"\")), $AE$10:$DZ$10),\"\")","v":""},{"$f":"IFERROR(LOOKUP(1, 1/((COUNTIF(EC$44:EC58, $AE$22:$DZ$22)=0)*($AE$22:$DZ$22<>\"\")), $AE$22:$DZ$22),\"\")","v":""},{"$f":"IFERROR(LOOKUP(1, 1/((COUNTIF(ED$44:ED58, $AE$34:$DZ$34)=0)*($AE$34:$DZ$34<>\"\")), $AE$34:$DZ$34),\"\")","v":""},{"$f":"IFERROR(LOOKUP(1, 1/((COUNTIF(EE$44:EE58, $AE$46:$DZ$46)=0)*($AE$46:$DZ$46<>\"\")), $AE$46:$DZ$46),\"\")","v":""},{"$f":"IFERROR(LOOKUP(1, 1/((COUNTIF(EF$44:EF58, $AE$58:$DZ$58)=0)*($AE$58:$DZ$58<>\"\")), $AE$58:$DZ$58),\"\")","v":""}]
[null,null,null,{"$f":"IF('Results and Analysis'!C107<>0,'Results and Analysis'!C107)","v":"B."},{"$f":"'Results and Analysis'!D107","v":"Insect repellant"},"4.24b",null,null,null,null,null,null,null,null,null,{"$f":"VLOOKUP(F60,'results compilation'!$A$2:$C$500,2,FALSE)","v":0},{"$f":"VLOOKUP(F60,'results compilation'!$A$2:$C$500,3,FALSE)","v":0},null,null,null,null,null,null,null,null,null,57,null,null,null,null,null,null,null,null,null,null,null,null,null,null,null,null,null,null,null,null,null,null,null,null,null,null,null,null,null,null,null,null,null,null,null,null,null,null,null,null,null,null,null,null,null,null,null,null,null,null,null,null,null,null,null,null,null,null,null,null,null,null,null,null,null,null,null,null,null,null,null,null,null,null,null,null,null,null,null,null,null,null,null,null,null,null,null,null,null,null,null,null,null,null,null,null,null,null,null,null,null,null,null,55,{"$f":"IFERROR(LOOKUP(1, 1/((COUNTIF(EB$44:EB59, $AE$10:$DZ$10)=0)*($AE$10:$DZ$10<>\"\")), $AE$10:$DZ$10),\"\")","v":""},{"$f":"IFERROR(LOOKUP(1, 1/((COUNTIF(EC$44:EC59, $AE$22:$DZ$22)=0)*($AE$22:$DZ$22<>\"\")), $AE$22:$DZ$22),\"\")","v":""},{"$f":"IFERROR(LOOKUP(1, 1/((COUNTIF(ED$44:ED59, $AE$34:$DZ$34)=0)*($AE$34:$DZ$34<>\"\")), $AE$34:$DZ$34),\"\")","v":""},{"$f":"IFERROR(LOOKUP(1, 1/((COUNTIF(EE$44:EE59, $AE$46:$DZ$46)=0)*($AE$46:$DZ$46<>\"\")), $AE$46:$DZ$46),\"\")","v":""},{"$f":"IFERROR(LOOKUP(1, 1/((COUNTIF(EF$44:EF59, $AE$58:$DZ$58)=0)*($AE$58:$DZ$58<>\"\")), $AE$58:$DZ$58),\"\")","v":""}]
[null,null,null,{"$f":"IF('Results and Analysis'!C108<>0,'Results and Analysis'!C108)","v":"C."},{"$f":"'Results and Analysis'!D108","v":"Lighting"},"4.24c",null,null,null,null,null,null,null,null,null,{"$f":"VLOOKUP(F61,'results compilation'!$A$2:$C$500,2,FALSE)","v":0},{"$f":"VLOOKUP(F61,'results compilation'!$A$2:$C$500,3,FALSE)","v":0},null,null,null,null,null,null,null,null,null,58,null,null,null,null,null,null,null,null,null,null,null,null,null,null,null,null,null,null,null,null,null,null,null,null,null,null,null,null,null,null,null,null,null,null,null,null,null,null,null,null,null,null,null,null,null,null,null,null,null,null,null,null,null,null,null,null,null,null,null,null,null,null,null,null,null,null,null,null,null,null,null,null,null,null,null,null,null,null,null,null,null,null,null,null,null,null,null,null,null,null,null,null,null,null,null,null,null,null,null,null,null,null,null,56,{"$f":"IFERROR(LOOKUP(1, 1/((COUNTIF(EB$44:EB60, $AE$10:$DZ$10)=0)*($AE$10:$DZ$10<>\"\")), $AE$10:$DZ$10),\"\")","v":""},{"$f":"IFERROR(LOOKUP(1, 1/((COUNTIF(EC$44:EC60, $AE$22:$DZ$22)=0)*($AE$22:$DZ$22<>\"\")), $AE$22:$DZ$22),\"\")","v":""},{"$f":"IFERROR(LOOKUP(1, 1/((COUNTIF(ED$44:ED60, $AE$34:$DZ$34)=0)*($AE$34:$DZ$34<>\"\")), $AE$34:$DZ$34),\"\")","v":""},{"$f":"IFERROR(LOOKUP(1, 1/((COUNTIF(EE$44:EE60, $AE$46:$DZ$46)=0)*($AE$46:$DZ$46<>\"\")), $AE$46:$DZ$46),\"\")","v":""},{"$f":"IFERROR(LOOKUP(1, 1/((COUNTIF(EF$44:EF60, $AE$58:$DZ$58)=0)*($AE$58:$DZ$58<>\"\")), $AE$58:$DZ$58),\"\")","v":""}]
[null,null,null,{"$f":"IF('Results and Analysis'!C109<>0,'Results and Analysis'!C109)","v":"D."},{"$f":"'Results and Analysis'!D109","v":"Portability"},"4.24d",null,null,null,null,null,null,null,null,null,{"$f":"VLOOKUP(F62,'results compilation'!$A$2:$C$500,2,FALSE)","v":0},{"$f":"VLOOKUP(F62,'results compilation'!$A$2:$C$500,3,FALSE)","v":0},null,null,null,null,null,null,null,null,null,59,null,null,null,null,null,null,null,null,null,null,null,null,null,null,null,null,null,null,null,null,null,null,null,null,null,null,null,null,null,null,null,null,null,null,null,null,null,null,null,null,null,null,null,null,null,null,null,null,null,null,null,null,null,null,null,null,null,null,null,null,null,null,null,null,null,null,null,null,null,null,null,null,null,null,null,null,null,null,null,null,null,null,null,null,null,null,null,null,null,null,null,null,null,null,null,null,null,null,null,null,null,null,null,57,{"$f":"IFERROR(LOOKUP(1, 1/((COUNTIF(EB$44:EB61, $AE$10:$DZ$10)=0)*($AE$10:$DZ$10<>\"\")), $AE$10:$DZ$10),\"\")","v":""},{"$f":"IFERROR(LOOKUP(1, 1/((COUNTIF(EC$44:EC61, $AE$22:$DZ$22)=0)*($AE$22:$DZ$22<>\"\")), $AE$22:$DZ$22),\"\")","v":""},{"$f":"IFERROR(LOOKUP(1, 1/((COUNTIF(ED$44:ED61, $AE$34:$DZ$34)=0)*($AE$34:$DZ$34<>\"\")), $AE$34:$DZ$34),\"\")","v":""},{"$f":"IFERROR(LOOKUP(1, 1/((COUNTIF(EE$44:EE61, $AE$46:$DZ$46)=0)*($AE$46:$DZ$46<>\"\")), $AE$46:$DZ$46),\"\")","v":""},{"$f":"IFERROR(LOOKUP(1, 1/((COUNTIF(EF$44:EF61, $AE$58:$DZ$58)=0)*($AE$58:$DZ$58<>\"\")), $AE$58:$DZ$58),\"\")","v":""}]
[null,null,null,{"$f":"IF('Results and Analysis'!C110<>0,'Results and Analysis'!C110)","v":"E."},{"$f":"'Results and Analysis'!D110","v":"Water heating"},"4.24e",null,null,null,null,null,null,null,null,null,{"$f":"VLOOKUP(F63,'results compilation'!$A$2:$C$500,2,FALSE)","v":0},{"$f":"VLOOKUP(F63,'results compilation'!$A$2:$C$500,3,FALSE)","v":0},null,null,null,null,null,null,null,null,null,60,null,null,null,null,null,null,null,null,null,null,null,null,null,null,null,null,null,null,null,null,null,null,null,null,null,null,null,null,null,null,null,null,null,null,null,null,null,null,null,null,null,null,null,null,null,null,null,null,null,null,null,null,null,null,null,null,null,null,null,null,null,null,null,null,null,null,null,null,null,null,null,null,null,null,null,null,null,null,null,null,null,null,null,null,null,null,null,null,null,null,null,null,null,null,null,null,null,null,null,null,null,null,null,58,{"$f":"IFERROR(LOOKUP(1, 1/((COUNTIF(EB$44:EB62, $AE$10:$DZ$10)=0)*($AE$10:$DZ$10<>\"\")), $AE$10:$DZ$10),\"\")","v":""},{"$f":"IFERROR(LOOKUP(1, 1/((COUNTIF(EC$44:EC62, $AE$22:$DZ$22)=0)*($AE$22:$DZ$22<>\"\")), $AE$22:$DZ$22),\"\")","v":""},{"$f":"IFERROR(LOOKUP(1, 1/((COUNTIF(ED$44:ED62, $AE$34:$DZ$34)=0)*($AE$34:$DZ$34<>\"\")), $AE$34:$DZ$34),\"\")","v":""},{"$f":"IFERROR(LOOKUP(1, 1/((COUNTIF(EE$44:EE62, $AE$46:$DZ$46)=0)*($AE$46:$DZ$46<>\"\")), $AE$46:$DZ$46),\"\")","v":""},{"$f":"IFERROR(LOOKUP(1, 1/((COUNTIF(EF$44:EF62, $AE$58:$DZ$58)=0)*($AE$58:$DZ$58<>\"\")), $AE$58:$DZ$58),\"\")","v":""}]
[null,null,null,{"$f":"IF('Results and Analysis'!C111<>0,'Results and Analysis'!C111)","v":"F."},{"$f":"'Results and Analysis'!D111","v":"Food drying or smoking"},"4.24f",null,null,null,null,null,null,null,null,null,{"$f":"VLOOKUP(F64,'results compilation'!$A$2:$C$500,2,FALSE)","v":0},{"$f":"VLOOKUP(F64,'results compilation'!$A$2:$C$500,3,FALSE)","v":0},null,null,null,null,null,null,null,null,null,61,null,null,null,null,null,null,null,null,null,null,null,null,null,null,null,null,null,null,null,null,null,null,null,null,null,null,null,null,null,null,null,null,null,null,null,null,null,null,null,null,null,null,null,null,null,null,null,null,null,null,null,null,null,null,null,null,null,null,null,null,null,null,null,null,null,null,null,null,null,null,null,null,null,null,null,null,null,null,null,null,null,null,null,null,null,null,null,null,null,null,null,null,null,null,null,null,null,null,null,null,null,null,null,59,{"$f":"IFERROR(LOOKUP(1, 1/((COUNTIF(EB$44:EB63, $AE$10:$DZ$10)=0)*($AE$10:$DZ$10<>\"\")), $AE$10:$DZ$10),\"\")","v":""},{"$f":"IFERROR(LOOKUP(1, 1/((COUNTIF(EC$44:EC63, $AE$22:$DZ$22)=0)*($AE$22:$DZ$22<>\"\")), $AE$22:$DZ$22),\"\")","v":""},{"$f":"IFERROR(LOOKUP(1, 1/((COUNTIF(ED$44:ED63, $AE$34:$DZ$34)=0)*($AE$34:$DZ$34<>\"\")), $AE$34:$DZ$34),\"\")","v":""},{"$f":"IFERROR(LOOKUP(1, 1/((COUNTIF(EE$44:EE63, $AE$46:$DZ$46)=0)*($AE$46:$DZ$46<>\"\")), $AE$46:$DZ$46),\"\")","v":""},{"$f":"IFERROR(LOOKUP(1, 1/((COUNTIF(EF$44:EF63, $AE$58:$DZ$58)=0)*($AE$58:$DZ$58<>\"\")), $AE$58:$DZ$58),\"\")","v":""}]
[null,null,null,{"$f":"IF('Results and Analysis'!C112<>0,'Results and Analysis'!C112)","v":"G."},{"$f":"'Results and Analysis'!D112","v":"Other 1:"},"4.24g",null,null,null,null,null,null,null,null,null,{"$f":"VLOOKUP(F65,'results compilation'!$A$2:$C$500,2,FALSE)","v":0},{"$f":"VLOOKUP(F65,'results compilation'!$A$2:$C$500,3,FALSE)","v":0},null,null,null,null,null,null,null,null,null,null,"Code sorting",null,null,null,null,null,null,null,null,null,null,null,null,null,null,null,null,null,null,"Results",null,null,null,null,null,null,null,null,null,null,null,null,null,null,null,null,null,null,null,null,null,null,null,null,null,null,null,null,null,null,null,null,null,null,null,null,null,null,null,null,null,null,null,null,null,null,null,null,null,null,null,null,null,null,null,null,null,null,null,null,null,null,null,null,null,null,null,null,null,null,null,null,null,null,null,null,null,null,null,null,null,null,null,60,{"$f":"IFERROR(LOOKUP(1, 1/((COUNTIF(EB$44:EB64, $AE$10:$DZ$10)=0)*($AE$10:$DZ$10<>\"\")), $AE$10:$DZ$10),\"\")","v":""},{"$f":"IFERROR(LOOKUP(1, 1/((COUNTIF(EC$44:EC64, $AE$22:$DZ$22)=0)*($AE$22:$DZ$22<>\"\")), $AE$22:$DZ$22),\"\")","v":""},{"$f":"IFERROR(LOOKUP(1, 1/((COUNTIF(ED$44:ED64, $AE$34:$DZ$34)=0)*($AE$34:$DZ$34<>\"\")), $AE$34:$DZ$34),\"\")","v":""},{"$f":"IFERROR(LOOKUP(1, 1/((COUNTIF(EE$44:EE64, $AE$46:$DZ$46)=0)*($AE$46:$DZ$46<>\"\")), $AE$46:$DZ$46),\"\")","v":""},{"$f":"IFERROR(LOOKUP(1, 1/((COUNTIF(EF$44:EF64, $AE$58:$DZ$58)=0)*($AE$58:$DZ$58<>\"\")), $AE$58:$DZ$58),\"\")","v":""}]
[null,null,null,{"$f":"IF('Results and Analysis'!C113<>0,'Results and Analysis'!C113)","v":"H."},{"$f":"'Results and Analysis'!D113","v":"Other 2:"},"4.24h",null,null,null,null,null,null,null,null,null,{"$f":"VLOOKUP(F66,'results compilation'!$A$2:$C$500,2,FALSE)","v":0},{"$f":"VLOOKUP(F66,'results compilation'!$A$2:$C$500,3,FALSE)","v":0},null,null,null,null,null,null,null,null,null,null,null,null,null,5.0999999999999996,"Sorted","Count",5.2,"Sorted","Count",5.3,"Sorted","Count",5.4,"Sorted","Count",5.5,"Sorted","Count",null,5.0999999999999996,null,null,5.2,null,null,5.3,null,null,5.4,null,null,5.5]
[null,null,null,null,null,null,null,null,null,null,null,null,null,null,null,null,null,null,null,null,null,null,null,null,null,null,null,null,null,null,"Cooks quickly",null,null,"Difficult to light",null,null,null,null,null,null,null,null,null,null,null,null,"Cooks quickly",0,null,"Difficult to light",0,null,null,0,null,null,0,null,null,0,null,null,null,null,null,null,null,null,null,null,null,null,null,null,null,null,null,null,null,null,null,null,null,null,null,null,null,null,null,null,null,null,null,null,null,null,null,null,null,null,null,null,null,null,null,null,null,null,null,null,null,null,null,null,null,null,null,null,null,null,null,null,null,null,null,null,null,null,null,null,61,{"$f":"IFERROR(LOOKUP(1, 1/((COUNTIF(EB$66:EB66, $AE$13:$DZ$13)=0)*($AE$13:$DZ$13<>\"\")), $AE$13:$DZ$13),\"\")","v":""},{"$f":"IFERROR(LOOKUP(1, 1/((COUNTIF(EC$66:EC66, $AE$25:$DZ$25)=0)*($AE$25:$DZ$25<>\"\")), $AE$25:$DZ$25),\"\")","v":""},{"$f":"IFERROR(LOOKUP(1, 1/((COUNTIF(ED$66:ED66, $AE$37:$DZ$37)=0)*($AE$37:$DZ$37<>\"\")), $AE$37:$DZ$37),\"\")","v":""},{"$f":"IFERROR(LOOKUP(1, 1/((COUNTIF(EE$66:EE66, $AE$49:$DZ$49)=0)*($AE$49:$DZ$49<>\"\")), $AE$49:$DZ$49),\"\")","v":""},{"$f":"IFERROR(LOOKUP(1, 1/((COUNTIF(EF$66:EF66, $AE$61:$DZ$61)=0)*($AE$61:$DZ$61<>\"\")), $AE$61:$DZ$61),\"\")","v":""}]
[null,null,null,null,null,null,null,null,null,null,null,null,null,null,null,null,null,null,null,null,null,null,null,null,null,null,null,"examples:",null,null,"Does not need repairs",null,null,"Fuel is too expensive",null,null,null,null,null,null,null,null,null,null,null,null,"Does not make much soot",0,null,"Easy to tip over",0,null,null,0,null,null,0,null,null,0,null,null,null,null,null,null,null,null,null,null,null,null,null,null,null,null,null,null,null,null,null,null,null,null,null,null,null,null,null,null,null,null,null,null,null,null,null,null,null,null,null,null,null,null,null,null,null,null,null,null,null,null,null,null,null,null,null,null,null,null,null,null,null,null,null,null,null,null,null,null,62,{"$f":"IFERROR(LOOKUP(1, 1/((COUNTIF(EB$66:EB67, $AE$13:$DZ$13)=0)*($AE$13:$DZ$13<>\"\")), $AE$13:$DZ$13),\"\")","v":""},{"$f":"IFERROR(LOOKUP(1, 1/((COUNTIF(EC$66:EC67, $AE$25:$DZ$25)=0)*($AE$25:$DZ$25<>\"\")), $AE$25:$DZ$25),\"\")","v":""},{"$f":"IFERROR(LOOKUP(1, 1/((COUNTIF(ED$66:ED67, $AE$37:$DZ$37)=0)*($AE$37:$DZ$37<>\"\")), $AE$37:$DZ$37),\"\")","v":""},{"$f":"IFERROR(LOOKUP(1, 1/((COUNTIF(EE$66:EE67, $AE$49:$DZ$49)=0)*($AE$49:$DZ$49<>\"\")), $AE$49:$DZ$49),\"\")","v":""},{"$f":"IFERROR(LOOKUP(1, 1/((COUNTIF(EF$66:EF67, $AE$61:$DZ$61)=0)*($AE$61:$DZ$61<>\"\")), $AE$61:$DZ$61),\"\")","v":""}]
[null,null,null,null,null,null,null,null,null,null,null,null,null,null,null,null,null,null,null,null,null,null,null,null,null,null,null,null,null,null,"Does not make much soot",null,null,"Easy to tip over",null,null,null,null,null,null,null,null,null,null,null,null,"Does not need repairs",0,null,"Fuel is too expensive",0,null,null,0,null,null,0,null,null,0,null,null,null,null,null,null,null,null,null,null,null,null,null,null,null,null,null,null,null,null,null,null,null,null,null,null,null,null,null,null,null,null,null,null,null,null,null,null,null,null,null,null,null,null,null,null,null,null,null,null,null,null,null,null,null,null,null,null,null,null,null,null,null,null,null,null,null,null,null,null,63,{"$f":"IFERROR(LOOKUP(1, 1/((COUNTIF(EB$66:EB68, $AE$13:$DZ$13)=0)*($AE$13:$DZ$13<>\"\")), $AE$13:$DZ$13),\"\")","v":""},{"$f":"IFERROR(LOOKUP(1, 1/((COUNTIF(EC$66:EC68, $AE$25:$DZ$25)=0)*($AE$25:$DZ$25<>\"\")), $AE$25:$DZ$25),\"\")","v":""},{"$f":"IFERROR(LOOKUP(1, 1/((COUNTIF(ED$66:ED68, $AE$37:$DZ$37)=0)*($AE$37:$DZ$37<>\"\")), $AE$37:$DZ$37),\"\")","v":""},{"$f":"IFERROR(LOOKUP(1, 1/((COUNTIF(EE$66:EE68, $AE$49:$DZ$49)=0)*($AE$49:$DZ$49<>\"\")), $AE$49:$DZ$49),\"\")","v":""},{"$f":"IFERROR(LOOKUP(1, 1/((COUNTIF(EF$66:EF68, $AE$61:$DZ$61)=0)*($AE$61:$DZ$61<>\"\")), $AE$61:$DZ$61),\"\")","v":""}]
[null,null,null,null,null,null,null,null,null,null,null,null,null,null,null,null,null,null,null,null,null,null,null,null,null,null,null,null,null,null,null,null,null,null,null,null,null,null,null,null,null,null,null,null,null,null,null,0,null,null,0,null,null,0,null,null,0,null,null,0,null,null,null,null,null,null,null,null,null,null,null,null,null,null,null,null,null,null,null,null,null,null,null,null,null,null,null,null,null,null,null,null,null,null,null,null,null,null,null,null,null,null,null,null,null,null,null,null,null,null,null,null,null,null,null,null,null,null,null,null,null,null,null,null,null,null,null,null,null,null,64,{"$f":"IFERROR(LOOKUP(1, 1/((COUNTIF(EB$66:EB69, $AE$13:$DZ$13)=0)*($AE$13:$DZ$13<>\"\")), $AE$13:$DZ$13),\"\")","v":""},{"$f":"IFERROR(LOOKUP(1, 1/((COUNTIF(EC$66:EC69, $AE$25:$DZ$25)=0)*($AE$25:$DZ$25<>\"\")), $AE$25:$DZ$25),\"\")","v":""},{"$f":"IFERROR(LOOKUP(1, 1/((COUNTIF(ED$66:ED69, $AE$37:$DZ$37)=0)*($AE$37:$DZ$37<>\"\")), $AE$37:$DZ$37),\"\")","v":""},{"$f":"IFERROR(LOOKUP(1, 1/((COUNTIF(EE$66:EE69, $AE$49:$DZ$49)=0)*($AE$49:$DZ$49<>\"\")), $AE$49:$DZ$49),\"\")","v":""},{"$f":"IFERROR(LOOKUP(1, 1/((COUNTIF(EF$66:EF69, $AE$61:$DZ$61)=0)*($AE$61:$DZ$61<>\"\")), $AE$61:$DZ$61),\"\")","v":""}]
[null,null,null,null,null,null,null,null,null,null,null,null,null,null,null,null,null,null,null,null,null,null,null,null,null,null,1,null,null,null,{"$f":"IFERROR(LOOKUP(1, 1/((COUNTIF(AE$70:AE70, EB$4:EB$89)=0)*(EB$4:EB$89<>\"\")), EB$4:EB$89),\"zzz\")","v":"Does not make much soot"},"Cooks quickly",{"$f":"COUNTIF($AE$4:$DZ$15,AF71)","v":0},{"$f":"IFERROR(LOOKUP(1, 1/((COUNTIF(AH$70:AH70, EC$4:EC$89)=0)*(EC$4:EC$89<>\"\")), EC$4:EC$89),\"zzz\")","v":"Easy to tip over"},"Difficult to light",{"$f":"COUNTIF($AE$16:$DZ$27,AI71)","v":0},{"$f":"IFERROR(LOOKUP(1, 1/((COUNTIF(AK$70:AK70, ED$4:ED$89)=0)*(ED$4:ED$89<>\"\")), ED$4:ED$89),\"zzz\")","v":"zzz"},null,{"$f":"COUNTIF($AE$28:$DZ$39,AL71)","v":0},{"$f":"IFERROR(LOOKUP(1, 1/((COUNTIF(AN$70:AN70, EE$4:EE$89)=0)*(EE$4:EE$89<>\"\")), EE$4:EE$89),\"zzz\")","v":"zzz"},null,{"$f":"COUNTIF($AE$40:$DZ$51,AO71)","v":0},{"$f":"IFERROR(LOOKUP(1, 1/((COUNTIF(AQ$70:AQ70, EF$4:EF$89)=0)*(EF$4:EF$89<>\"\")), EF$4:EF$89),\"zzz\")","v":"zzz"},null,{"$f":"COUNTIF($AE$52:$DZ$63,AR71)","v":0},null,null,0,null,null,0,null,null,0,null,null,0,null,null,0,null,null,null,null,null,null,null,null,null,null,null,null,null,null,null,null,null,null,null,null,null,null,null,null,null,null,null,null,null,null,null,null,null,null,null,null,null,null,null,null,null,null,null,null,null,null,null,null,null,null,null,null,null,null,null,null,null,null,null,null,null,null,null,null,null,null,null,null,null,null,65,{"$f":"IFERROR(LOOKUP(1, 1/((COUNTIF(EB$66:EB70, $AE$13:$DZ$13)=0)*($AE$13:$DZ$13<>\"\")), $AE$13:$DZ$13),\"\")","v":""},{"$f":"IFERROR(LOOKUP(1, 1/((COUNTIF(EC$66:EC70, $AE$25:$DZ$25)=0)*($AE$25:$DZ$25<>\"\")), $AE$25:$DZ$25),\"\")","v":""},{"$f":"IFERROR(LOOKUP(1, 1/((COUNTIF(ED$66:ED70, $AE$37:$DZ$37)=0)*($AE$37:$DZ$37<>\"\")), $AE$37:$DZ$37),\"\")","v":""},{"$f":"IFERROR(LOOKUP(1, 1/((COUNTIF(EE$66:EE70, $AE$49:$DZ$49)=0)*($AE$49:$DZ$49<>\"\")), $AE$49:$DZ$49),\"\")","v":""},{"$f":"IFERROR(LOOKUP(1, 1/((COUNTIF(EF$66:EF70, $AE$61:$DZ$61)=0)*($AE$61:$DZ$61<>\"\")), $AE$61:$DZ$61),\"\")","v":""}]
[null,null,null,null,null,null,null,null,null,null,null,null,null,null,null,null,null,null,null,null,null,null,null,null,null,null,2,null,null,null,{"$f":"IFERROR(LOOKUP(1, 1/((COUNTIF(AE$70:AE71, EB$4:EB$89)=0)*(EB$4:EB$89<>\"\")), EB$4:EB$89),\"zzz\")","v":"Does not need repairs"},"Does not make much soot",{"$f":"COUNTIF($AE$4:$DZ$15,AF72)","v":0},{"$f":"IFERROR(LOOKUP(1, 1/((COUNTIF(AH$70:AH71, EC$4:EC$89)=0)*(EC$4:EC$89<>\"\")), EC$4:EC$89),\"zzz\")","v":"Fuel is too expensive"},"Easy to tip over",0,{"$f":"IFERROR(LOOKUP(1, 1/((COUNTIF(AK$70:AK71, ED$4:ED$89)=0)*(ED$4:ED$89<>\"\")), ED$4:ED$89),\"zzz\")","v":"zzz"},null,{"$f":"COUNTIF($AE$28:$DZ$39,AL72)","v":0},{"$f":"IFERROR(LOOKUP(1, 1/((COUNTIF(AN$70:AN71, EE$4:EE$89)=0)*(EE$4:EE$89<>\"\")), EE$4:EE$89),\"zzz\")","v":"zzz"},null,{"$f":"COUNTIF($AE$40:$DZ$51,AO72)","v":0},{"$f":"IFERROR(LOOKUP(1, 1/((COUNTIF(AQ$70:AQ71, EF$4:EF$89)=0)*(EF$4:EF$89<>\"\")), EF$4:EF$89),\"zzz\")","v":"zzz"},null,{"$f":"COUNTIF($AE$52:$DZ$63,AR72)","v":0},null,null,0,null,null,0,null,null,0,null,null,0,null,null,0,null,null,null,null,null,null,null,null,null,null,null,null,null,null,null,null,null,null,null,null,null,null,null,null,null,null,null,null,null,null,null,null,null,null,null,null,null,null,null,null,null,null,null,null,null,null,null,null,null,null,null,null,null,null,null,null,null,null,null,null,null,null,null,null,null,null,null,null,null,null,66,{"$f":"IFERROR(LOOKUP(1, 1/((COUNTIF(EB$66:EB71, $AE$13:$DZ$13)=0)*($AE$13:$DZ$13<>\"\")), $AE$13:$DZ$13),\"\")","v":""},{"$f":"IFERROR(LOOKUP(1, 1/((COUNTIF(EC$66:EC71, $AE$25:$DZ$25)=0)*($AE$25:$DZ$25<>\"\")), $AE$25:$DZ$25),\"\")","v":""},{"$f":"IFERROR(LOOKUP(1, 1/((COUNTIF(ED$66:ED71, $AE$37:$DZ$37)=0)*($AE$37:$DZ$37<>\"\")), $AE$37:$DZ$37),\"\")","v":""},{"$f":"IFERROR(LOOKUP(1, 1/((COUNTIF(EE$66:EE71, $AE$49:$DZ$49)=0)*($AE$49:$DZ$49<>\"\")), $AE$49:$DZ$49),\"\")","v":""},{"$f":"IFERROR(LOOKUP(1, 1/((COUNTIF(EF$66:EF71, $AE$61:$DZ$61)=0)*($AE$61:$DZ$61<>\"\")), $AE$61:$DZ$61),\"\")","v":""}]
[null,null,null,null,null,null,null,null,null,null,null,null,null,null,null,null,null,null,null,null,null,null,null,null,null,null,3,null,null,null,{"$f":"IFERROR(LOOKUP(1, 1/((COUNTIF(AE$70:AE72, EB$4:EB$89)=0)*(EB$4:EB$89<>\"\")), EB$4:EB$89),\"zzz\")","v":"Cooks quickly"},"Does not need repairs",0,{"$f":"IFERROR(LOOKUP(1, 1/((COUNTIF(AH$70:AH72, EC$4:EC$89)=0)*(EC$4:EC$89<>\"\")), EC$4:EC$89),\"zzz\")","v":"Difficult to light"},"Fuel is too expensive",0,{"$f":"IFERROR(LOOKUP(1, 1/((COUNTIF(AK$70:AK72, ED$4:ED$89)=0)*(ED$4:ED$89<>\"\")), ED$4:ED$89),\"zzz\")","v":"zzz"},null,0,{"$f":"IFERROR(LOOKUP(1, 1/((COUNTIF(AN$70:AN72, EE$4:EE$89)=0)*(EE$4:EE$89<>\"\")), EE$4:EE$89),\"zzz\")","v":"zzz"},null,0,{"$f":"IFERROR(LOOKUP(1, 1/((COUNTIF(AQ$70:AQ72, EF$4:EF$89)=0)*(EF$4:EF$89<>\"\")), EF$4:EF$89),\"zzz\")","v":"zzz"},null,0,null,null,0,null,null,0,null,null,0,null,null,0,null,null,0,null,null,null,null,null,null,null,null,null,null,null,null,null,null,null,null,null,null,null,null,null,null,null,null,null,null,null,null,null,null,null,null,null,null,null,null,null,null,null,null,null,null,null,null,null,null,null,null,null,null,null,null,null,null,null,null,null,null,null,null,null,null,null,null,null,null,null,null,null,null,67,{"$f":"IFERROR(LOOKUP(1, 1/((COUNTIF(EB$66:EB72, $AE$13:$DZ$13)=0)*($AE$13:$DZ$13<>\"\")), $AE$13:$DZ$13),\"\")","v":""},{"$f":"IFERROR(LOOKUP(1, 1/((COUNTIF(EC$66:EC72, $AE$25:$DZ$25)=0)*($AE$25:$DZ$25<>\"\")), $AE$25:$DZ$25),\"\")","v":""},{"$f":"IFERROR(LOOKUP(1, 1/((COUNTIF(ED$66:ED72, $AE$37:$DZ$37)=0)*($AE$37:$DZ$37<>\"\")), $AE$37:$DZ$37),\"\")","v":""},{"$f":"IFERROR(LOOKUP(1, 1/((COUNTIF(EE$66:EE72, $AE$49:$DZ$49)=0)*($AE$49:$DZ$49<>\"\")), $AE$49:$DZ$49),\"\")","v":""},{"$f":"IFERROR(LOOKUP(1, 1/((COUNTIF(EF$66:EF72, $AE$61:$DZ$61)=0)*($AE$61:$DZ$61<>\"\")), $AE$61:$DZ$61),\"\")","v":""}]
[null,null,null,null,null,null,null,null,null,null,null,null,null,null,null,null,null,null,null,null,null,null,null,null,null,null,4,null,null,null,{"$f":"IFERROR(LOOKUP(1, 1/((COUNTIF(AE$70:AE73, EB$4:EB$89)=0)*(EB$4:EB$89<>\"\")), EB$4:EB$89),\"zzz\")","v":"zzz"},null,0,{"$f":"IFERROR(LOOKUP(1, 1/((COUNTIF(AH$70:AH73, EC$4:EC$89)=0)*(EC$4:EC$89<>\"\")), EC$4:EC$89),\"zzz\")","v":"zzz"},null,0,{"$f":"IFERROR(LOOKUP(1, 1/((COUNTIF(AK$70:AK73, ED$4:ED$89)=0)*(ED$4:ED$89<>\"\")), ED$4:ED$89),\"zzz\")","v":"zzz"},null,0,{"$f":"IFERROR(LOOKUP(1, 1/((COUNTIF(AN$70:AN73, EE$4:EE$89)=0)*(EE$4:EE$89<>\"\")), EE$4:EE$89),\"zzz\")","v":"zzz"},null,0,{"$f":"IFERROR(LOOKUP(1, 1/((COUNTIF(AQ$70:AQ73, EF$4:EF$89)=0)*(EF$4:EF$89<>\"\")), EF$4:EF$89),\"zzz\")","v":"zzz"},null,0,null,null,0,null,null,0,null,null,0,null,null,0,null,null,0,null,null,null,null,null,null,null,null,null,null,null,null,null,null,null,null,null,null,null,null,null,null,null,null,null,null,null,null,null,null,null,null,null,null,null,null,null,null,null,null,null,null,null,null,null,null,null,null,null,null,null,null,null,null,null,null,null,null,null,null,null,null,null,null,null,null,null,null,null,null,68,{"$f":"IFERROR(LOOKUP(1, 1/((COUNTIF(EB$66:EB73, $AE$13:$DZ$13)=0)*($AE$13:$DZ$13<>\"\")), $AE$13:$DZ$13),\"\")","v":""},{"$f":"IFERROR(LOOKUP(1, 1/((COUNTIF(EC$66:EC73, $AE$25:$DZ$25)=0)*($AE$25:$DZ$25<>\"\")), $AE$25:$DZ$25),\"\")","v":""},{"$f":"IFERROR(LOOKUP(1, 1/((COUNTIF(ED$66:ED73, $AE$37:$DZ$37)=0)*($AE$37:$DZ$37<>\"\")), $AE$37:$DZ$37),\"\")","v":""},{"$f":"IFERROR(LOOKUP(1, 1/((COUNTIF(EE$66:EE73, $AE$49:$DZ$49)=0)*($AE$49:$DZ$49<>\"\")), $AE$49:$DZ$49),\"\")","v":""},{"$f":"IFERROR(LOOKUP(1, 1/((COUNTIF(EF$66:EF73, $AE$61:$DZ$61)=0)*($AE$61:$DZ$61<>\"\")), $AE$61:$DZ$61),\"\")","v":""}]
[null,null,null,null,null,null,null,null,null,null,null,null,null,null,null,null,null,null,null,null,null,null,null,null,null,null,5,null,null,null,{"$f":"IFERROR(LOOKUP(1, 1/((COUNTIF(AE$70:AE74, EB$4:EB$89)=0)*(EB$4:EB$89<>\"\")), EB$4:EB$89),\"zzz\")","v":"zzz"},null,0,{"$f":"IFERROR(LOOKUP(1, 1/((COUNTIF(AH$70:AH74, EC$4:EC$89)=0)*(EC$4:EC$89<>\"\")), EC$4:EC$89),\"zzz\")","v":"zzz"},null,0,{"$f":"IFERROR(LOOKUP(1, 1/((COUNTIF(AK$70:AK74, ED$4:ED$89)=0)*(ED$4:ED$89<>\"\")), ED$4:ED$89),\"zzz\")","v":"zzz"},null,0,{"$f":"IFERROR(LOOKUP(1, 1/((COUNTIF(AN$70:AN74, EE$4:EE$89)=0)*(EE$4:EE$89<>\"\")), EE$4:EE$89),\"zzz\")","v":"zzz"},null,0,{"$f":"IFERROR(LOOKUP(1, 1/((COUNTIF(AQ$70:AQ74, EF$4:EF$89)=0)*(EF$4:EF$89<>\"\")), EF$4:EF$89),\"zzz\")","v":"zzz"},null,0,null,null,0,null,null,0,null,null,0,null,null,0,null,null,0,null,null,null,null,null,null,null,null,null,null,null,null,null,null,null,null,null,null,null,null,null,null,null,null,null,null,null,null,null,null,null,null,null,null,null,null,null,null,null,null,null,null,null,null,null,null,null,null,null,null,null,null,null,null,null,null,null,null,null,null,null,null,null,null,null,null,null,null,null,null,69,{"$f":"IFERROR(LOOKUP(1, 1/((COUNTIF(EB$66:EB74, $AE$13:$DZ$13)=0)*($AE$13:$DZ$13<>\"\")), $AE$13:$DZ$13),\"\")","v":""},{"$f":"IFERROR(LOOKUP(1, 1/((COUNTIF(EC$66:EC74, $AE$25:$DZ$25)=0)*($AE$25:$DZ$25<>\"\")), $AE$25:$DZ$25),\"\")","v":""},{"$f":"IFERROR(LOOKUP(1, 1/((COUNTIF(ED$66:ED74, $AE$37:$DZ$37)=0)*($AE$37:$DZ$37<>\"\")), $AE$37:$DZ$37),\"\")","v":""},{"$f":"IFERROR(LOOKUP(1, 1/((COUNTIF(EE$66:EE74, $AE$49:$DZ$49)=0)*($AE$49:$DZ$49<>\"\")), $AE$49:$DZ$49),\"\")","v":""},{"$f":"IFERROR(LOOKUP(1, 1/((COUNTIF(EF$66:EF74, $AE$61:$DZ$61)=0)*($AE$61:$DZ$61<>\"\")), $AE$61:$DZ$61),\"\")","v":""}]
[null,null,null,null,null,null,null,null,null,null,null,null,null,null,null,null,null,null,null,null,null,null,null,null,null,null,6,null,null,null,{"$f":"IFERROR(LOOKUP(1, 1/((COUNTIF(AE$70:AE75, EB$4:EB$89)=0)*(EB$4:EB$89<>\"\")), EB$4:EB$89),\"zzz\")","v":"zzz"},null,0,{"$f":"IFERROR(LOOKUP(1, 1/((COUNTIF(AH$70:AH75, EC$4:EC$89)=0)*(EC$4:EC$89<>\"\")), EC$4:EC$89),\"zzz\")","v":"zzz"},null,0,{"$f":"IFERROR(LOOKUP(1, 1/((COUNTIF(AK$70:AK75, ED$4:ED$89)=0)*(ED$4:ED$89<>\"\")), ED$4:ED$89),\"zzz\")","v":"zzz"},null,0,{"$f":"IFERROR(LOOKUP(1, 1/((COUNTIF(AN$70:AN75, EE$4:EE$89)=0)*(EE$4:EE$89<>\"\")), EE$4:EE$89),\"zzz\")","v":"zzz"},null,0,{"$f":"IFERROR(LOOKUP(1, 1/((COUNTIF(AQ$70:AQ75, EF$4:EF$89)=0)*(EF$4:EF$89<>\"\")), EF$4:EF$89),\"zzz\")","v":"zzz"},null,0,null,null,0,null,null,0,null,null,0,null,null,0,null,null,0,null,null,null,null,null,null,null,null,null,null,null,null,null,null,null,null,null,null,null,null,null,null,null,null,null,null,null,null,null,null,null,null,null,null,null,null,null,null,null,null,null,null,null,null,null,null,null,null,null,null,null,null,null,null,null,null,null,null,null,null,null,null,null,null,null,null,null,null,null,null,70,{"$f":"IFERROR(LOOKUP(1, 1/((COUNTIF(EB$66:EB75, $AE$13:$DZ$13)=0)*($AE$13:$DZ$13<>\"\")), $AE$13:$DZ$13),\"\")","v":""},{"$f":"IFERROR(LOOKUP(1, 1/((COUNTIF(EC$66:EC75, $AE$25:$DZ$25)=0)*($AE$25:$DZ$25<>\"\")), $AE$25:$DZ$25),\"\")","v":""},{"$f":"IFERROR(LOOKUP(1, 1/((COUNTIF(ED$66:ED75, $AE$37:$DZ$37)=0)*($AE$37:$DZ$37<>\"\")), $AE$37:$DZ$37),\"\")","v":""},{"$f":"IFERROR(LOOKUP(1, 1/((COUNTIF(EE$66:EE75, $AE$49:$DZ$49)=0)*($AE$49:$DZ$49<>\"\")), $AE$49:$DZ$49),\"\")","v":""},{"$f":"IFERROR(LOOKUP(1, 1/((COUNTIF(EF$66:EF75, $AE$61:$DZ$61)=0)*($AE$61:$DZ$61<>\"\")), $AE$61:$DZ$61),\"\")","v":""}]
[null,null,null,null,null,null,null,null,null,null,null,null,null,null,null,null,null,null,null,null,null,null,null,null,null,null,7,null,null,null,{"$f":"IFERROR(LOOKUP(1, 1/((COUNTIF(AE$70:AE76, EB$4:EB$89)=0)*(EB$4:EB$89<>\"\")), EB$4:EB$89),\"zzz\")","v":"zzz"},null,0,{"$f":"IFERROR(LOOKUP(1, 1/((COUNTIF(AH$70:AH76, EC$4:EC$89)=0)*(EC$4:EC$89<>\"\")), EC$4:EC$89),\"zzz\")","v":"zzz"},null,0,{"$f":"IFERROR(LOOKUP(1, 1/((COUNTIF(AK$70:AK76, ED$4:ED$89)=0)*(ED$4:ED$89<>\"\")), ED$4:ED$89),\"zzz\")","v":"zzz"},null,0,{"$f":"IFERROR(LOOKUP(1, 1/((COUNTIF(AN$70:AN76, EE$4:EE$89)=0)*(EE$4:EE$89<>\"\")), EE$4:EE$89),\"zzz\")","v":"zzz"},null,0,{"$f":"IFERROR(LOOKUP(1, 1/((COUNTIF(AQ$70:AQ76, EF$4:EF$89)=0)*(EF$4:EF$89<>\"\")), EF$4:EF$89),\"zzz\")","v":"zzz"},null,0,null,null,0,null,null,0,null,null,0,null,null,0,null,null,0,null,null,null,null,null,null,null,null,null,null,null,null,null,null,null,null,null,null,null,null,null,null,null,null,null,null,null,null,null,null,null,null,null,null,null,null,null,null,null,null,null,null,null,null,null,null,null,null,null,null,null,null,null,null,null,null,null,null,null,null,null,null,null,null,null,null,null,null,null,null,71,{"$f":"IFERROR(LOOKUP(1, 1/((COUNTIF(EB$66:EB76, $AE$13:$DZ$13)=0)*($AE$13:$DZ$13<>\"\")), $AE$13:$DZ$13),\"\")","v":""},{"$f":"IFERROR(LOOKUP(1, 1/((COUNTIF(EC$66:EC76, $AE$25:$DZ$25)=0)*($AE$25:$DZ$25<>\"\")), $AE$25:$DZ$25),\"\")","v":""},{"$f":"IFERROR(LOOKUP(1, 1/((COUNTIF(ED$66:ED76, $AE$37:$DZ$37)=0)*($AE$37:$DZ$37<>\"\")), $AE$37:$DZ$37),\"\")","v":""},{"$f":"IFERROR(LOOKUP(1, 1/((COUNTIF(EE$66:EE76, $AE$49:$DZ$49)=0)*($AE$49:$DZ$49<>\"\")), $AE$49:$DZ$49),\"\")","v":""},{"$f":"IFERROR(LOOKUP(1, 1/((COUNTIF(EF$66:EF76, $AE$61:$DZ$61)=0)*($AE$61:$DZ$61<>\"\")), $AE$61:$DZ$61),\"\")","v":""}]
[null,null,null,null,null,null,null,null,null,null,null,null,null,null,null,null,null,null,null,null,null,null,null,null,null,null,8,null,null,null,{"$f":"IFERROR(LOOKUP(1, 1/((COUNTIF(AE$70:AE77, EB$4:EB$89)=0)*(EB$4:EB$89<>\"\")), EB$4:EB$89),\"zzz\")","v":"zzz"},null,0,{"$f":"IFERROR(LOOKUP(1, 1/((COUNTIF(AH$70:AH77, EC$4:EC$89)=0)*(EC$4:EC$89<>\"\")), EC$4:EC$89),\"zzz\")","v":"zzz"},null,0,{"$f":"IFERROR(LOOKUP(1, 1/((COUNTIF(AK$70:AK77, ED$4:ED$89)=0)*(ED$4:ED$89<>\"\")), ED$4:ED$89),\"zzz\")","v":"zzz"},null,0,{"$f":"IFERROR(LOOKUP(1, 1/((COUNTIF(AN$70:AN77, EE$4:EE$89)=0)*(EE$4:EE$89<>\"\")), EE$4:EE$89),\"zzz\")","v":"zzz"},null,0,{"$f":"IFERROR(LOOKUP(1, 1/((COUNTIF(AQ$70:AQ77, EF$4:EF$89)=0)*(EF$4:EF$89<>\"\")), EF$4:EF$89),\"zzz\")","v":"zzz"},null,0,null,null,0,null,null,0,null,null,0,null,null,0,null,null,0,null,null,null,null,null,null,null,null,null,null,null,null,null,null,null,null,null,null,null,null,null,null,null,null,null,null,null,null,null,null,null,null,null,null,null,null,null,null,null,null,null,null,null,null,null,null,null,null,null,null,null,null,null,null,null,null,null,null,null,null,null,null,null,null,null,null,null,null,null,null,72,{"$f":"IFERROR(LOOKUP(1, 1/((COUNTIF(EB$66:EB77, $AE$13:$DZ$13)=0)*($AE$13:$DZ$13<>\"\")), $AE$13:$DZ$13),\"\")","v":""},{"$f":"IFERROR(LOOKUP(1, 1/((COUNTIF(EC$66:EC77, $AE$25:$DZ$25)=0)*($AE$25:$DZ$25<>\"\")), $AE$25:$DZ$25),\"\")","v":""},{"$f":"IFERROR(LOOKUP(1, 1/((COUNTIF(ED$66:ED77, $AE$37:$DZ$37)=0)*($AE$37:$DZ$37<>\"\")), $AE$37:$DZ$37),\"\")","v":""},{"$f":"IFERROR(LOOKUP(1, 1/((COUNTIF(EE$66:EE77, $AE$49:$DZ$49)=0)*($AE$49:$DZ$49<>\"\")), $AE$49:$DZ$49),\"\")","v":""},{"$f":"IFERROR(LOOKUP(1, 1/((COUNTIF(EF$66:EF77, $AE$61:$DZ$61)=0)*($AE$61:$DZ$61<>\"\")), $AE$61:$DZ$61),\"\")","v":""}]
[null,null,null,null,null,null,null,null,null,null,null,null,null,null,null,null,null,null,null,null,null,null,null,null,null,null,9,null,null,null,{"$f":"IFERROR(LOOKUP(1, 1/((COUNTIF(AE$70:AE78, EB$4:EB$89)=0)*(EB$4:EB$89<>\"\")), EB$4:EB$89),\"zzz\")","v":"zzz"},null,0,{"$f":"IFERROR(LOOKUP(1, 1/((COUNTIF(AH$70:AH78, EC$4:EC$89)=0)*(EC$4:EC$89<>\"\")), EC$4:EC$89),\"zzz\")","v":"zzz"},null,0,{"$f":"IFERROR(LOOKUP(1, 1/((COUNTIF(AK$70:AK78, ED$4:ED$89)=0)*(ED$4:ED$89<>\"\")), ED$4:ED$89),\"zzz\")","v":"zzz"},null,0,{"$f":"IFERROR(LOOKUP(1, 1/((COUNTIF(AN$70:AN78, EE$4:EE$89)=0)*(EE$4:EE$89<>\"\")), EE$4:EE$89),\"zzz\")","v":"zzz"},null,0,{"$f":"IFERROR(LOOKUP(1, 1/((COUNTIF(AQ$70:AQ78, EF$4:EF$89)=0)*(EF$4:EF$89<>\"\")), EF$4:EF$89),\"zzz\")","v":"zzz"},null,0,null,null,0,null,null,0,null,null,0,null,null,0,null,null,0,null,null,null,null,null,null,null,null,null,null,null,null,null,null,null,null,null,null,null,null,null,null,null,null,null,null,null,null,null,null,null,null,null,null,null,null,null,null,null,null,null,null,null,null,null,null,null,null,null,null,null,null,null,null,null,null,null,null,null,null,null,null,null,null,null,null,null,null,null,null,73,{"$f":"IFERROR(LOOKUP(1, 1/((COUNTIF(EB$66:EB78, $AE$13:$DZ$13)=0)*($AE$13:$DZ$13<>\"\")), $AE$13:$DZ$13),\"\")","v":""},{"$f":"IFERROR(LOOKUP(1, 1/((COUNTIF(EC$66:EC78, $AE$25:$DZ$25)=0)*($AE$25:$DZ$25<>\"\")), $AE$25:$DZ$25),\"\")","v":""},{"$f":"IFERROR(LOOKUP(1, 1/((COUNTIF(ED$66:ED78, $AE$37:$DZ$37)=0)*($AE$37:$DZ$37<>\"\")), $AE$37:$DZ$37),\"\")","v":""},{"$f":"IFERROR(LOOKUP(1, 1/((COUNTIF(EE$66:EE78, $AE$49:$DZ$49)=0)*($AE$49:$DZ$49<>\"\")), $AE$49:$DZ$49),\"\")","v":""},{"$f":"IFERROR(LOOKUP(1, 1/((COUNTIF(EF$66:EF78, $AE$61:$DZ$61)=0)*($AE$61:$DZ$61<>\"\")), $AE$61:$DZ$61),\"\")","v":""}]
[null,null,null,null,null,null,null,null,null,null,null,null,null,null,null,null,null,null,null,null,null,null,null,null,null,null,10,null,null,null,{"$f":"IFERROR(LOOKUP(1, 1/((COUNTIF(AE$70:AE79, EB$4:EB$89)=0)*(EB$4:EB$89<>\"\")), EB$4:EB$89),\"zzz\")","v":"zzz"},null,0,{"$f":"IFERROR(LOOKUP(1, 1/((COUNTIF(AH$70:AH79, EC$4:EC$89)=0)*(EC$4:EC$89<>\"\")), EC$4:EC$89),\"zzz\")","v":"zzz"},null,0,{"$f":"IFERROR(LOOKUP(1, 1/((COUNTIF(AK$70:AK79, ED$4:ED$89)=0)*(ED$4:ED$89<>\"\")), ED$4:ED$89),\"zzz\")","v":"zzz"},null,0,{"$f":"IFERROR(LOOKUP(1, 1/((COUNTIF(AN$70:AN79, EE$4:EE$89)=0)*(EE$4:EE$89<>\"\")), EE$4:EE$89),\"zzz\")","v":"zzz"},null,0,{"$f":"IFERROR(LOOKUP(1, 1/((COUNTIF(AQ$70:AQ79, EF$4:EF$89)=0)*(EF$4:EF$89<>\"\")), EF$4:EF$89),\"zzz\")","v":"zzz"},null,0,null,null,0,null,null,0,null,null,0,null,null,0,null,null,0,null,null,null,null,null,null,null,null,null,null,null,null,null,null,null,null,null,null,null,null,null,null,null,null,null,null,null,null,null,null,null,null,null,null,null,null,null,null,null,null,null,null,null,null,null,null,null,null,null,null,null,null,null,null,null,null,null,null,null,null,null,null,null,null,null,null,null,null,null,null,74,{"$f":"IFERROR(LOOKUP(1, 1/((COUNTIF(EB$66:EB79, $AE$13:$DZ$13)=0)*($AE$13:$DZ$13<>\"\")), $AE$13:$DZ$13),\"\")","v":""},{"$f":"IFERROR(LOOKUP(1, 1/((COUNTIF(EC$66:EC79, $AE$25:$DZ$25)=0)*($AE$25:$DZ$25<>\"\")), $AE$25:$DZ$25),\"\")","v":""},{"$f":"IFERROR(LOOKUP(1, 1/((COUNTIF(ED$66:ED79, $AE$37:$DZ$37)=0)*($AE$37:$DZ$37<>\"\")), $AE$37:$DZ$37),\"\")","v":""},{"$f":"IFERROR(LOOKUP(1, 1/((COUNTIF(EE$66:EE79, $AE$49:$DZ$49)=0)*($AE$49:$DZ$49<>\"\")), $AE$49:$DZ$49),\"\")","v":""},{"$f":"IFERROR(LOOKUP(1, 1/((COUNTIF(EF$66:EF79, $AE$61:$DZ$61)=0)*($AE$61:$DZ$61<>\"\")), $AE$61:$DZ$61),\"\")","v":""}]
[null,null,null,null,null,null,null,null,null,null,null,null,null,null,null,null,null,null,null,null,null,null,null,null,null,null,11,null,null,null,{"$f":"IFERROR(LOOKUP(1, 1/((COUNTIF(AE$70:AE80, EB$4:EB$89)=0)*(EB$4:EB$89<>\"\")), EB$4:EB$89),\"zzz\")","v":"zzz"},null,0,{"$f":"IFERROR(LOOKUP(1, 1/((COUNTIF(AH$70:AH80, EC$4:EC$89)=0)*(EC$4:EC$89<>\"\")), EC$4:EC$89),\"zzz\")","v":"zzz"},null,0,{"$f":"IFERROR(LOOKUP(1, 1/((COUNTIF(AK$70:AK80, ED$4:ED$89)=0)*(ED$4:ED$89<>\"\")), ED$4:ED$89),\"zzz\")","v":"zzz"},null,0,{"$f":"IFERROR(LOOKUP(1, 1/((COUNTIF(AN$70:AN80, EE$4:EE$89)=0)*(EE$4:EE$89<>\"\")), EE$4:EE$89),\"zzz\")","v":"zzz"},null,0,{"$f":"IFERROR(LOOKUP(1, 1/((COUNTIF(AQ$70:AQ80, EF$4:EF$89)=0)*(EF$4:EF$89<>\"\")), EF$4:EF$89),\"zzz\")","v":"zzz"},null,0,null,null,0,null,null,0,null,null,0,null,null,0,null,null,0,null,null,null,null,null,null,null,null,null,null,null,null,null,null,null,null,null,null,null,null,null,null,null,null,null,null,null,null,null,null,null,null,null,null,null,null,null,null,null,null,null,null,null,null,null,null,null,null,null,null,null,null,null,null,null,null,null,null,null,null,null,null,null,null,null,null,null,null,null,null,75,{"$f":"IFERROR(LOOKUP(1, 1/((COUNTIF(EB$66:EB80, $AE$13:$DZ$13)=0)*($AE$13:$DZ$13<>\"\")), $AE$13:$DZ$13),\"\")","v":""},{"$f":"IFERROR(LOOKUP(1, 1/((COUNTIF(EC$66:EC80, $AE$25:$DZ$25)=0)*($AE$25:$DZ$25<>\"\")), $AE$25:$DZ$25),\"\")","v":""},{"$f":"IFERROR(LOOKUP(1, 1/((COUNTIF(ED$66:ED80, $AE$37:$DZ$37)=0)*($AE$37:$DZ$37<>\"\")), $AE$37:$DZ$37),\"\")","v":""},{"$f":"IFERROR(LOOKUP(1, 1/((COUNTIF(EE$66:EE80, $AE$49:$DZ$49)=0)*($AE$49:$DZ$49<>\"\")), $AE$49:$DZ$49),\"\")","v":""},{"$f":"IFERROR(LOOKUP(1, 1/((COUNTIF(EF$66:EF80, $AE$61:$DZ$61)=0)*($AE$61:$DZ$61<>\"\")), $AE$61:$DZ$61),\"\")","v":""}]
[null,null,null,null,null,null,null,null,null,null,null,null,null,null,null,null,null,null,null,null,null,null,null,null,null,null,12,null,null,null,{"$f":"IFERROR(LOOKUP(1, 1/((COUNTIF(AE$70:AE81, EB$4:EB$89)=0)*(EB$4:EB$89<>\"\")), EB$4:EB$89),\"zzz\")","v":"zzz"},null,0,{"$f":"IFERROR(LOOKUP(1, 1/((COUNTIF(AH$70:AH81, EC$4:EC$89)=0)*(EC$4:EC$89<>\"\")), EC$4:EC$89),\"zzz\")","v":"zzz"},null,0,{"$f":"IFERROR(LOOKUP(1, 1/((COUNTIF(AK$70:AK81, ED$4:ED$89)=0)*(ED$4:ED$89<>\"\")), ED$4:ED$89),\"zzz\")","v":"zzz"},null,0,{"$f":"IFERROR(LOOKUP(1, 1/((COUNTIF(AN$70:AN81, EE$4:EE$89)=0)*(EE$4:EE$89<>\"\")), EE$4:EE$89),\"zzz\")","v":"zzz"},null,0,{"$f":"IFERROR(LOOKUP(1, 1/((COUNTIF(AQ$70:AQ81, EF$4:EF$89)=0)*(EF$4:EF$89<>\"\")), EF$4:EF$89),\"zzz\")","v":"zzz"},null,0,null,null,0,null,null,0,null,null,0,null,null,0,null,null,0,null,null,null,null,null,null,null,null,null,null,null,null,null,null,null,null,null,null,null,null,null,null,null,null,null,null,null,null,null,null,null,null,null,null,null,null,null,null,null,null,null,null,null,null,null,null,null,null,null,null,null,null,null,null,null,null,null,null,null,null,null,null,null,null,null,null,null,null,null,null,76,{"$f":"IFERROR(LOOKUP(1, 1/((COUNTIF(EB$66:EB81, $AE$13:$DZ$13)=0)*($AE$13:$DZ$13<>\"\")), $AE$13:$DZ$13),\"\")","v":""},{"$f":"IFERROR(LOOKUP(1, 1/((COUNTIF(EC$66:EC81, $AE$25:$DZ$25)=0)*($AE$25:$DZ$25<>\"\")), $AE$25:$DZ$25),\"\")","v":""},{"$f":"IFERROR(LOOKUP(1, 1/((COUNTIF(ED$66:ED81, $AE$37:$DZ$37)=0)*($AE$37:$DZ$37<>\"\")), $AE$37:$DZ$37),\"\")","v":""},{"$f":"IFERROR(LOOKUP(1, 1/((COUNTIF(EE$66:EE81, $AE$49:$DZ$49)=0)*($AE$49:$DZ$49<>\"\")), $AE$49:$DZ$49),\"\")","v":""},{"$f":"IFERROR(LOOKUP(1, 1/((COUNTIF(EF$66:EF81, $AE$61:$DZ$61)=0)*($AE$61:$DZ$61<>\"\")), $AE$61:$DZ$61),\"\")","v":""}]
[null,null,null,null,null,null,null,null,null,null,null,null,null,null,null,null,null,null,null,null,null,null,null,null,null,null,13,null,null,null,{"$f":"IFERROR(LOOKUP(1, 1/((COUNTIF(AE$70:AE82, EB$4:EB$89)=0)*(EB$4:EB$89<>\"\")), EB$4:EB$89),\"zzz\")","v":"zzz"},null,0,{"$f":"IFERROR(LOOKUP(1, 1/((COUNTIF(AH$70:AH82, EC$4:EC$89)=0)*(EC$4:EC$89<>\"\")), EC$4:EC$89),\"zzz\")","v":"zzz"},null,0,{"$f":"IFERROR(LOOKUP(1, 1/((COUNTIF(AK$70:AK82, ED$4:ED$89)=0)*(ED$4:ED$89<>\"\")), ED$4:ED$89),\"zzz\")","v":"zzz"},null,0,{"$f":"IFERROR(LOOKUP(1, 1/((COUNTIF(AN$70:AN82, EE$4:EE$89)=0)*(EE$4:EE$89<>\"\")), EE$4:EE$89),\"zzz\")","v":"zzz"},null,0,{"$f":"IFERROR(LOOKUP(1, 1/((COUNTIF(AQ$70:AQ82, EF$4:EF$89)=0)*(EF$4:EF$89<>\"\")), EF$4:EF$89),\"zzz\")","v":"zzz"},null,0,null,null,0,null,null,0,null,null,0,null,null,0,null,null,0,null,null,null,null,null,null,null,null,null,null,null,null,null,null,null,null,null,null,null,null,null,null,null,null,null,null,null,null,null,null,null,null,null,null,null,null,null,null,null,null,null,null,null,null,null,null,null,null,null,null,null,null,null,null,null,null,null,null,null,null,null,null,null,null,null,null,null,null,null,null,77,{"$f":"IFERROR(LOOKUP(1, 1/((COUNTIF(EB$66:EB82, $AE$13:$DZ$13)=0)*($AE$13:$DZ$13<>\"\")), $AE$13:$DZ$13),\"\")","v":""},{"$f":"IFERROR(LOOKUP(1, 1/((COUNTIF(EC$66:EC82, $AE$25:$DZ$25)=0)*($AE$25:$DZ$25<>\"\")), $AE$25:$DZ$25),\"\")","v":""},{"$f":"IFERROR(LOOKUP(1, 1/((COUNTIF(ED$66:ED82, $AE$37:$DZ$37)=0)*($AE$37:$DZ$37<>\"\")), $AE$37:$DZ$37),\"\")","v":""},{"$f":"IFERROR(LOOKUP(1, 1/((COUNTIF(EE$66:EE82, $AE$49:$DZ$49)=0)*($AE$49:$DZ$49<>\"\")), $AE$49:$DZ$49),\"\")","v":""},{"$f":"IFERROR(LOOKUP(1, 1/((COUNTIF(EF$66:EF82, $AE$61:$DZ$61)=0)*($AE$61:$DZ$61<>\"\")), $AE$61:$DZ$61),\"\")","v":""}]
[null,null,null,null,null,null,null,null,null,null,null,null,null,null,null,null,null,null,null,null,null,null,null,null,null,null,14,null,null,null,{"$f":"IFERROR(LOOKUP(1, 1/((COUNTIF(AE$70:AE83, EB$4:EB$89)=0)*(EB$4:EB$89<>\"\")), EB$4:EB$89),\"zzz\")","v":"zzz"},null,0,{"$f":"IFERROR(LOOKUP(1, 1/((COUNTIF(AH$70:AH83, EC$4:EC$89)=0)*(EC$4:EC$89<>\"\")), EC$4:EC$89),\"zzz\")","v":"zzz"},null,0,{"$f":"IFERROR(LOOKUP(1, 1/((COUNTIF(AK$70:AK83, ED$4:ED$89)=0)*(ED$4:ED$89<>\"\")), ED$4:ED$89),\"zzz\")","v":"zzz"},null,0,{"$f":"IFERROR(LOOKUP(1, 1/((COUNTIF(AN$70:AN83, EE$4:EE$89)=0)*(EE$4:EE$89<>\"\")), EE$4:EE$89),\"zzz\")","v":"zzz"},null,0,{"$f":"IFERROR(LOOKUP(1, 1/((COUNTIF(AQ$70:AQ83, EF$4:EF$89)=0)*(EF$4:EF$89<>\"\")), EF$4:EF$89),\"zzz\")","v":"zzz"},null,0,null,null,0,null,null,0,null,null,0,null,null,0,null,null,0,null,null,null,null,null,null,null,null,null,null,null,null,null,null,null,null,null,null,null,null,null,null,null,null,null,null,null,null,null,null,null,null,null,null,null,null,null,null,null,null,null,null,null,null,null,null,null,null,null,null,null,null,null,null,null,null,null,null,null,null,null,null,null,null,null,null,null,null,null,null,78,{"$f":"IFERROR(LOOKUP(1, 1/((COUNTIF(EB$66:EB83, $AE$13:$DZ$13)=0)*($AE$13:$DZ$13<>\"\")), $AE$13:$DZ$13),\"\")","v":""},{"$f":"IFERROR(LOOKUP(1, 1/((COUNTIF(EC$66:EC83, $AE$25:$DZ$25)=0)*($AE$25:$DZ$25<>\"\")), $AE$25:$DZ$25),\"\")","v":""},{"$f":"IFERROR(LOOKUP(1, 1/((COUNTIF(ED$66:ED83, $AE$37:$DZ$37)=0)*($AE$37:$DZ$37<>\"\")), $AE$37:$DZ$37),\"\")","v":""},{"$f":"IFERROR(LOOKUP(1, 1/((COUNTIF(EE$66:EE83, $AE$49:$DZ$49)=0)*($AE$49:$DZ$49<>\"\")), $AE$49:$DZ$49),\"\")","v":""},{"$f":"IFERROR(LOOKUP(1, 1/((COUNTIF(EF$66:EF83, $AE$61:$DZ$61)=0)*($AE$61:$DZ$61<>\"\")), $AE$61:$DZ$61),\"\")","v":""}]
[null,null,null,null,null,null,null,null,null,null,null,null,null,null,null,null,null,null,null,null,null,null,null,null,null,null,15,null,null,null,{"$f":"IFERROR(LOOKUP(1, 1/((COUNTIF(AE$70:AE84, EB$4:EB$89)=0)*(EB$4:EB$89<>\"\")), EB$4:EB$89),\"zzz\")","v":"zzz"},null,0,{"$f":"IFERROR(LOOKUP(1, 1/((COUNTIF(AH$70:AH84, EC$4:EC$89)=0)*(EC$4:EC$89<>\"\")), EC$4:EC$89),\"zzz\")","v":"zzz"},null,0,{"$f":"IFERROR(LOOKUP(1, 1/((COUNTIF(AK$70:AK84, ED$4:ED$89)=0)*(ED$4:ED$89<>\"\")), ED$4:ED$89),\"zzz\")","v":"zzz"},null,0,{"$f":"IFERROR(LOOKUP(1, 1/((COUNTIF(AN$70:AN84, EE$4:EE$89)=0)*(EE$4:EE$89<>\"\")), EE$4:EE$89),\"zzz\")","v":"zzz"},null,0,{"$f":"IFERROR(LOOKUP(1, 1/((COUNTIF(AQ$70:AQ84, EF$4:EF$89)=0)*(EF$4:EF$89<>\"\")), EF$4:EF$89),\"zzz\")","v":"zzz"},null,0,null,null,0,null,null,0,null,null,0,null,null,0,null,null,0,null,null,null,null,null,null,null,null,null,null,null,null,null,null,null,null,null,null,null,null,null,null,null,null,null,null,null,null,null,null,null,null,null,null,null,null,null,null,null,null,null,null,null,null,null,null,null,null,null,null,null,null,null,null,null,null,null,null,null,null,null,null,null,null,null,null,null,null,null,null,79,{"$f":"IFERROR(LOOKUP(1, 1/((COUNTIF(EB$66:EB84, $AE$13:$DZ$13)=0)*($AE$13:$DZ$13<>\"\")), $AE$13:$DZ$13),\"\")","v":""},{"$f":"IFERROR(LOOKUP(1, 1/((COUNTIF(EC$66:EC84, $AE$25:$DZ$25)=0)*($AE$25:$DZ$25<>\"\")), $AE$25:$DZ$25),\"\")","v":""},{"$f":"IFERROR(LOOKUP(1, 1/((COUNTIF(ED$66:ED84, $AE$37:$DZ$37)=0)*($AE$37:$DZ$37<>\"\")), $AE$37:$DZ$37),\"\")","v":""},{"$f":"IFERROR(LOOKUP(1, 1/((COUNTIF(EE$66:EE84, $AE$49:$DZ$49)=0)*($AE$49:$DZ$49<>\"\")), $AE$49:$DZ$49),\"\")","v":""},{"$f":"IFERROR(LOOKUP(1, 1/((COUNTIF(EF$66:EF84, $AE$61:$DZ$61)=0)*($AE$61:$DZ$61<>\"\")), $AE$61:$DZ$61),\"\")","v":""}]
[null,null,null,null,null,null,null,null,null,null,null,null,null,null,null,null,null,null,null,null,null,null,null,null,null,null,16,null,null,null,{"$f":"IFERROR(LOOKUP(1, 1/((COUNTIF(AE$70:AE85, EB$4:EB$89)=0)*(EB$4:EB$89<>\"\")), EB$4:EB$89),\"zzz\")","v":"zzz"},null,0,{"$f":"IFERROR(LOOKUP(1, 1/((COUNTIF(AH$70:AH85, EC$4:EC$89)=0)*(EC$4:EC$89<>\"\")), EC$4:EC$89),\"zzz\")","v":"zzz"},null,0,{"$f":"IFERROR(LOOKUP(1, 1/((COUNTIF(AK$70:AK85, ED$4:ED$89)=0)*(ED$4:ED$89<>\"\")), ED$4:ED$89),\"zzz\")","v":"zzz"},null,0,{"$f":"IFERROR(LOOKUP(1, 1/((COUNTIF(AN$70:AN85, EE$4:EE$89)=0)*(EE$4:EE$89<>\"\")), EE$4:EE$89),\"zzz\")","v":"zzz"},null,0,{"$f":"IFERROR(LOOKUP(1, 1/((COUNTIF(AQ$70:AQ85, EF$4:EF$89)=0)*(EF$4:EF$89<>\"\")), EF$4:EF$89),\"zzz\")","v":"zzz"},null,0,null,null,0,null,null,0,null,null,0,null,null,0,null,null,0,null,null,null,null,null,null,null,null,null,null,null,null,null,null,null,null,null,null,null,null,null,null,null,null,null,null,null,null,null,null,null,null,null,null,null,null,null,null,null,null,null,null,null,null,null,null,null,null,null,null,null,null,null,null,null,null,null,null,null,null,null,null,null,null,null,null,null,null,null,null,80,{"$f":"IFERROR(LOOKUP(1, 1/((COUNTIF(EB$66:EB85, $AE$13:$DZ$13)=0)*($AE$13:$DZ$13<>\"\")), $AE$13:$DZ$13),\"\")","v":""},{"$f":"IFERROR(LOOKUP(1, 1/((COUNTIF(EC$66:EC85, $AE$25:$DZ$25)=0)*($AE$25:$DZ$25<>\"\")), $AE$25:$DZ$25),\"\")","v":""},{"$f":"IFERROR(LOOKUP(1, 1/((COUNTIF(ED$66:ED85, $AE$37:$DZ$37)=0)*($AE$37:$DZ$37<>\"\")), $AE$37:$DZ$37),\"\")","v":""},{"$f":"IFERROR(LOOKUP(1, 1/((COUNTIF(EE$66:EE85, $AE$49:$DZ$49)=0)*($AE$49:$DZ$49<>\"\")), $AE$49:$DZ$49),\"\")","v":""},{"$f":"IFERROR(LOOKUP(1, 1/((COUNTIF(EF$66:EF85, $AE$61:$DZ$61)=0)*($AE$61:$DZ$61<>\"\")), $AE$61:$DZ$61),\"\")","v":""}]
[null,null,null,null,null,null,null,null,null,null,null,null,null,null,null,null,null,null,null,null,null,null,null,null,null,null,17,null,null,null,{"$f":"IFERROR(LOOKUP(1, 1/((COUNTIF(AE$70:AE86, EB$4:EB$89)=0)*(EB$4:EB$89<>\"\")), EB$4:EB$89),\"zzz\")","v":"zzz"},null,0,{"$f":"IFERROR(LOOKUP(1, 1/((COUNTIF(AH$70:AH86, EC$4:EC$89)=0)*(EC$4:EC$89<>\"\")), EC$4:EC$89),\"zzz\")","v":"zzz"},null,0,{"$f":"IFERROR(LOOKUP(1, 1/((COUNTIF(AK$70:AK86, ED$4:ED$89)=0)*(ED$4:ED$89<>\"\")), ED$4:ED$89),\"zzz\")","v":"zzz"},null,0,{"$f":"IFERROR(LOOKUP(1, 1/((COUNTIF(AN$70:AN86, EE$4:EE$89)=0)*(EE$4:EE$89<>\"\")), EE$4:EE$89),\"zzz\")","v":"zzz"},null,0,{"$f":"IFERROR(LOOKUP(1, 1/((COUNTIF(AQ$70:AQ86, EF$4:EF$89)=0)*(EF$4:EF$89<>\"\")), EF$4:EF$89),\"zzz\")","v":"zzz"},null,0,null,null,0,null,null,0,null,null,0,null,null,0,null,null,0,null,null,null,null,null,null,null,null,null,null,null,null,null,null,null,null,null,null,null,null,null,null,null,null,null,null,null,null,null,null,null,null,null,null,null,null,null,null,null,null,null,null,null,null,null,null,null,null,null,null,null,null,null,null,null,null,null,null,null,null,null,null,null,null,null,null,null,null,null,null,"examples:",{"$f":"AE67","v":"Cooks quickly"},{"$f":"AH67","v":"Difficult to light"}]
[null,null,null,null,null,null,null,null,null,null,null,null,null,null,null,null,null,null,null,null,null,null,null,null,null,null,18,null,null,null,{"$f":"IFERROR(LOOKUP(1, 1/((COUNTIF(AE$70:AE87, EB$4:EB$89)=0)*(EB$4:EB$89<>\"\")), EB$4:EB$89),\"zzz\")","v":"zzz"},null,0,{"$f":"IFERROR(LOOKUP(1, 1/((COUNTIF(AH$70:AH87, EC$4:EC$89)=0)*(EC$4:EC$89<>\"\")), EC$4:EC$89),\"zzz\")","v":"zzz"},null,0,{"$f":"IFERROR(LOOKUP(1, 1/((COUNTIF(AK$70:AK87, ED$4:ED$89)=0)*(ED$4:ED$89<>\"\")), ED$4:ED$89),\"zzz\")","v":"zzz"},null,0,{"$f":"IFERROR(LOOKUP(1, 1/((COUNTIF(AN$70:AN87, EE$4:EE$89)=0)*(EE$4:EE$89<>\"\")), EE$4:EE$89),\"zzz\")","v":"zzz"},null,0,{"$f":"IFERROR(LOOKUP(1, 1/((COUNTIF(AQ$70:AQ87, EF$4:EF$89)=0)*(EF$4:EF$89<>\"\")), EF$4:EF$89),\"zzz\")","v":"zzz"},null,0,null,null,0,null,null,0,null,null,0,null,null,0,null,null,0,null,null,null,null,null,null,null,null,null,null,null,null,null,null,null,null,null,null,null,null,null,null,null,null,null,null,null,null,null,null,null,null,null,null,null,null,null,null,null,null,null,null,null,null,null,null,null,null,null,null,null,null,null,null,null,null,null,null,null,null,null,null,null,null,null,null,null,null,null,null,null,{"$f":"AE68","v":"Does not need repairs"},{"$f":"AH68","v":"Fuel is too expensive"}]
[null,null,null,null,null,null,null,null,null,null,null,null,null,null,null,null,null,null,null,null,null,null,null,null,null,null,19,null,null,null,{"$f":"IFERROR(LOOKUP(1, 1/((COUNTIF(AE$70:AE88, EB$4:EB$89)=0)*(EB$4:EB$89<>\"\")), EB$4:EB$89),\"zzz\")","v":"zzz"},null,0,{"$f":"IFERROR(LOOKUP(1, 1/((COUNTIF(AH$70:AH88, EC$4:EC$89)=0)*(EC$4:EC$89<>\"\")), EC$4:EC$89),\"zzz\")","v":"zzz"},null,0,{"$f":"IFERROR(LOOKUP(1, 1/((COUNTIF(AK$70:AK88, ED$4:ED$89)=0)*(ED$4:ED$89<>\"\")), ED$4:ED$89),\"zzz\")","v":"zzz"},null,0,{"$f":"IFERROR(LOOKUP(1, 1/((COUNTIF(AN$70:AN88, EE$4:EE$89)=0)*(EE$4:EE$89<>\"\")), EE$4:EE$89),\"zzz\")","v":"zzz"},null,0,{"$f":"IFERROR(LOOKUP(1, 1/((COUNTIF(AQ$70:AQ88, EF$4:EF$89)=0)*(EF$4:EF$89<>\"\")), EF$4:EF$89),\"zzz\")","v":"zzz"},null,0,null,null,0,null,null,0,null,null,0,null,null,0,null,null,0,null,null,null,null,null,null,null,null,null,null,null,null,null,null,null,null,null,null,null,null,null,null,null,null,null,null,null,null,null,null,null,null,null,null,null,null,null,null,null,null,null,null,null,null,null,null,null,null,null,null,null,null,null,null,null,null,null,null,null,null,null,null,null,null,null,null,null,null,null,null,null,"Does not make much soot","Easy to tip over",{"$f":"\"\"","v":""},{"$f":"\"\"","v":""},{"$f":"\"\"","v":""}]
[null,null,null,null,null,null,null,null,null,null,null,null,null,null,null,null,null,null,null,null,null,null,null,null,null,null,20,null,null,null,{"$f":"IFERROR(LOOKUP(1, 1/((COUNTIF(AE$70:AE89, EB$4:EB$89)=0)*(EB$4:EB$89<>\"\")), EB$4:EB$89),\"zzz\")","v":"zzz"},null,0,{"$f":"IFERROR(LOOKUP(1, 1/((COUNTIF(AH$70:AH89, EC$4:EC$89)=0)*(EC$4:EC$89<>\"\")), EC$4:EC$89),\"zzz\")","v":"zzz"},null,0,{"$f":"IFERROR(LOOKUP(1, 1/((COUNTIF(AK$70:AK89, ED$4:ED$89)=0)*(ED$4:ED$89<>\"\")), ED$4:ED$89),\"zzz\")","v":"zzz"},null,0,{"$f":"IFERROR(LOOKUP(1, 1/((COUNTIF(AN$70:AN89, EE$4:EE$89)=0)*(EE$4:EE$89<>\"\")), EE$4:EE$89),\"zzz\")","v":"zzz"},null,0,{"$f":"IFERROR(LOOKUP(1, 1/((COUNTIF(AQ$70:AQ89, EF$4:EF$89)=0)*(EF$4:EF$89<>\"\")), EF$4:EF$89),\"zzz\")","v":"zzz"},null,0,null,null,0,null,null,0,null,null,0,null,null,0,null,null,0]
[null,null,null,null,null,null,null,null,null,null,null,null,null,null,null,null,null,null,null,null,null,null,null,null,null,null,21,null,null,null,{"$f":"IFERROR(LOOKUP(1, 1/((COUNTIF(AE$70:AE90, EB$4:EB$89)=0)*(EB$4:EB$89<>\"\")), EB$4:EB$89),\"zzz\")","v":"zzz"},null,0,{"$f":"IFERROR(LOOKUP(1, 1/((COUNTIF(AH$70:AH90, EC$4:EC$89)=0)*(EC$4:EC$89<>\"\")), EC$4:EC$89),\"zzz\")","v":"zzz"},null,0,{"$f":"IFERROR(LOOKUP(1, 1/((COUNTIF(AK$70:AK90, ED$4:ED$89)=0)*(ED$4:ED$89<>\"\")), ED$4:ED$89),\"zzz\")","v":"zzz"},null,0,{"$f":"IFERROR(LOOKUP(1, 1/((COUNTIF(AN$70:AN90, EE$4:EE$89)=0)*(EE$4:EE$89<>\"\")), EE$4:EE$89),\"zzz\")","v":"zzz"},null,0,{"$f":"IFERROR(LOOKUP(1, 1/((COUNTIF(AQ$70:AQ90, EF$4:EF$89)=0)*(EF$4:EF$89<>\"\")), EF$4:EF$89),\"zzz\")","v":"zzz"},null,0,null,null,0,null,null,0,null,null,0,null,null,0,null,null,0]
[null,null,null,null,null,null,null,null,null,null,null,null,null,null,null,null,null,null,null,null,null,null,null,null,null,null,22,null,null,null,{"$f":"IFERROR(LOOKUP(1, 1/((COUNTIF(AE$70:AE91, EB$4:EB$89)=0)*(EB$4:EB$89<>\"\")), EB$4:EB$89),\"zzz\")","v":"zzz"},null,0,{"$f":"IFERROR(LOOKUP(1, 1/((COUNTIF(AH$70:AH91, EC$4:EC$89)=0)*(EC$4:EC$89<>\"\")), EC$4:EC$89),\"zzz\")","v":"zzz"},null,0,{"$f":"IFERROR(LOOKUP(1, 1/((COUNTIF(AK$70:AK91, ED$4:ED$89)=0)*(ED$4:ED$89<>\"\")), ED$4:ED$89),\"zzz\")","v":"zzz"},null,0,{"$f":"IFERROR(LOOKUP(1, 1/((COUNTIF(AN$70:AN91, EE$4:EE$89)=0)*(EE$4:EE$89<>\"\")), EE$4:EE$89),\"zzz\")","v":"zzz"},null,0,{"$f":"IFERROR(LOOKUP(1, 1/((COUNTIF(AQ$70:AQ91, EF$4:EF$89)=0)*(EF$4:EF$89<>\"\")), EF$4:EF$89),\"zzz\")","v":"zzz"},null,0,null,null,0,null,null,0,null,null,0,null,null,0,null,null,0]
[null,null,null,null,null,null,null,null,null,null,null,null,null,null,null,null,null,null,null,null,null,null,null,null,null,null,23,null,null,null,{"$f":"IFERROR(LOOKUP(1, 1/((COUNTIF(AE$70:AE92, EB$4:EB$89)=0)*(EB$4:EB$89<>\"\")), EB$4:EB$89),\"zzz\")","v":"zzz"},null,0,{"$f":"IFERROR(LOOKUP(1, 1/((COUNTIF(AH$70:AH92, EC$4:EC$89)=0)*(EC$4:EC$89<>\"\")), EC$4:EC$89),\"zzz\")","v":"zzz"},null,0,{"$f":"IFERROR(LOOKUP(1, 1/((COUNTIF(AK$70:AK92, ED$4:ED$89)=0)*(ED$4:ED$89<>\"\")), ED$4:ED$89),\"zzz\")","v":"zzz"},null,0,{"$f":"IFERROR(LOOKUP(1, 1/((COUNTIF(AN$70:AN92, EE$4:EE$89)=0)*(EE$4:EE$89<>\"\")), EE$4:EE$89),\"zzz\")","v":"zzz"},null,0,{"$f":"IFERROR(LOOKUP(1, 1/((COUNTIF(AQ$70:AQ92, EF$4:EF$89)=0)*(EF$4:EF$89<>\"\")), EF$4:EF$89),\"zzz\")","v":"zzz"},null,0,null,null,0,null,null,0,null,null,0,null,null,0,null,null,0]
[null,null,null,null,null,null,null,null,null,null,null,null,null,null,null,null,null,null,null,null,null,null,null,null,null,null,24,null,null,null,{"$f":"IFERROR(LOOKUP(1, 1/((COUNTIF(AE$70:AE93, EB$4:EB$89)=0)*(EB$4:EB$89<>\"\")), EB$4:EB$89),\"zzz\")","v":"zzz"},null,0,{"$f":"IFERROR(LOOKUP(1, 1/((COUNTIF(AH$70:AH93, EC$4:EC$89)=0)*(EC$4:EC$89<>\"\")), EC$4:EC$89),\"zzz\")","v":"zzz"},null,0,{"$f":"IFERROR(LOOKUP(1, 1/((COUNTIF(AK$70:AK93, ED$4:ED$89)=0)*(ED$4:ED$89<>\"\")), ED$4:ED$89),\"zzz\")","v":"zzz"},null,0,{"$f":"IFERROR(LOOKUP(1, 1/((COUNTIF(AN$70:AN93, EE$4:EE$89)=0)*(EE$4:EE$89<>\"\")), EE$4:EE$89),\"zzz\")","v":"zzz"},null,0,{"$f":"IFERROR(LOOKUP(1, 1/((COUNTIF(AQ$70:AQ93, EF$4:EF$89)=0)*(EF$4:EF$89<>\"\")), EF$4:EF$89),\"zzz\")","v":"zzz"},null,0,null,null,0,null,null,0,null,null,0,null,null,0,null,null,0]
[null,null,null,null,null,null,null,null,null,null,null,null,null,null,null,null,null,null,null,null,null,null,null,null,null,null,25,null,null,null,{"$f":"IFERROR(LOOKUP(1, 1/((COUNTIF(AE$70:AE94, EB$4:EB$89)=0)*(EB$4:EB$89<>\"\")), EB$4:EB$89),\"zzz\")","v":"zzz"},null,0,{"$f":"IFERROR(LOOKUP(1, 1/((COUNTIF(AH$70:AH94, EC$4:EC$89)=0)*(EC$4:EC$89<>\"\")), EC$4:EC$89),\"zzz\")","v":"zzz"},null,0,{"$f":"IFERROR(LOOKUP(1, 1/((COUNTIF(AK$70:AK94, ED$4:ED$89)=0)*(ED$4:ED$89<>\"\")), ED$4:ED$89),\"zzz\")","v":"zzz"},null,0,{"$f":"IFERROR(LOOKUP(1, 1/((COUNTIF(AN$70:AN94, EE$4:EE$89)=0)*(EE$4:EE$89<>\"\")), EE$4:EE$89),\"zzz\")","v":"zzz"},null,0,{"$f":"IFERROR(LOOKUP(1, 1/((COUNTIF(AQ$70:AQ94, EF$4:EF$89)=0)*(EF$4:EF$89<>\"\")), EF$4:EF$89),\"zzz\")","v":"zzz"},null,0,null,null,0,null,null,0,null,null,0,null,null,0,null,null,0]
[null,null,null,null,null,null,null,null,null,null,null,null,null,null,null,null,null,null,null,null,null,null,null,null,null,null,26,null,null,null,{"$f":"IFERROR(LOOKUP(1, 1/((COUNTIF(AE$70:AE95, EB$4:EB$89)=0)*(EB$4:EB$89<>\"\")), EB$4:EB$89),\"zzz\")","v":"zzz"},null,0,{"$f":"IFERROR(LOOKUP(1, 1/((COUNTIF(AH$70:AH95, EC$4:EC$89)=0)*(EC$4:EC$89<>\"\")), EC$4:EC$89),\"zzz\")","v":"zzz"},null,0,{"$f":"IFERROR(LOOKUP(1, 1/((COUNTIF(AK$70:AK95, ED$4:ED$89)=0)*(ED$4:ED$89<>\"\")), ED$4:ED$89),\"zzz\")","v":"zzz"},null,0,{"$f":"IFERROR(LOOKUP(1, 1/((COUNTIF(AN$70:AN95, EE$4:EE$89)=0)*(EE$4:EE$89<>\"\")), EE$4:EE$89),\"zzz\")","v":"zzz"},null,0,{"$f":"IFERROR(LOOKUP(1, 1/((COUNTIF(AQ$70:AQ95, EF$4:EF$89)=0)*(EF$4:EF$89<>\"\")), EF$4:EF$89),\"zzz\")","v":"zzz"},null,0,null,null,0,null,null,0,null,null,0,null,null,0,null,null,0]
[null,null,null,null,null,null,null,null,null,null,null,null,null,null,null,null,null,null,null,null,null,null,null,null,null,null,27,null,null,null,{"$f":"IFERROR(LOOKUP(1, 1/((COUNTIF(AE$70:AE96, EB$4:EB$89)=0)*(EB$4:EB$89<>\"\")), EB$4:EB$89),\"zzz\")","v":"zzz"},null,0,{"$f":"IFERROR(LOOKUP(1, 1/((COUNTIF(AH$70:AH96, EC$4:EC$89)=0)*(EC$4:EC$89<>\"\")), EC$4:EC$89),\"zzz\")","v":"zzz"},null,0,{"$f":"IFERROR(LOOKUP(1, 1/((COUNTIF(AK$70:AK96, ED$4:ED$89)=0)*(ED$4:ED$89<>\"\")), ED$4:ED$89),\"zzz\")","v":"zzz"},null,0,{"$f":"IFERROR(LOOKUP(1, 1/((COUNTIF(AN$70:AN96, EE$4:EE$89)=0)*(EE$4:EE$89<>\"\")), EE$4:EE$89),\"zzz\")","v":"zzz"},null,0,{"$f":"IFERROR(LOOKUP(1, 1/((COUNTIF(AQ$70:AQ96, EF$4:EF$89)=0)*(EF$4:EF$89<>\"\")), EF$4:EF$89),\"zzz\")","v":"zzz"},null,0,null,null,0,null,null,0,null,null,0,null,null,0,null,null,0]
[null,null,null,null,null,null,null,null,null,null,null,null,null,null,null,null,null,null,null,null,null,null,null,null,null,null,28,null,null,null,{"$f":"IFERROR(LOOKUP(1, 1/((COUNTIF(AE$70:AE97, EB$4:EB$89)=0)*(EB$4:EB$89<>\"\")), EB$4:EB$89),\"zzz\")","v":"zzz"},null,0,{"$f":"IFERROR(LOOKUP(1, 1/((COUNTIF(AH$70:AH97, EC$4:EC$89)=0)*(EC$4:EC$89<>\"\")), EC$4:EC$89),\"zzz\")","v":"zzz"},null,0,{"$f":"IFERROR(LOOKUP(1, 1/((COUNTIF(AK$70:AK97, ED$4:ED$89)=0)*(ED$4:ED$89<>\"\")), ED$4:ED$89),\"zzz\")","v":"zzz"},null,0,{"$f":"IFERROR(LOOKUP(1, 1/((COUNTIF(AN$70:AN97, EE$4:EE$89)=0)*(EE$4:EE$89<>\"\")), EE$4:EE$89),\"zzz\")","v":"zzz"},null,0,{"$f":"IFERROR(LOOKUP(1, 1/((COUNTIF(AQ$70:AQ97, EF$4:EF$89)=0)*(EF$4:EF$89<>\"\")), EF$4:EF$89),\"zzz\")","v":"zzz"},null,0,null,null,0,null,null,0,null,null,0,null,null,0,null,null,0]
[null,null,null,null,null,null,null,null,null,null,null,null,null,null,null,null,null,null,null,null,null,null,null,null,null,null,29,null,null,null,{"$f":"IFERROR(LOOKUP(1, 1/((COUNTIF(AE$70:AE98, EB$4:EB$89)=0)*(EB$4:EB$89<>\"\")), EB$4:EB$89),\"zzz\")","v":"zzz"},null,0,{"$f":"IFERROR(LOOKUP(1, 1/((COUNTIF(AH$70:AH98, EC$4:EC$89)=0)*(EC$4:EC$89<>\"\")), EC$4:EC$89),\"zzz\")","v":"zzz"},null,0,{"$f":"IFERROR(LOOKUP(1, 1/((COUNTIF(AK$70:AK98, ED$4:ED$89)=0)*(ED$4:ED$89<>\"\")), ED$4:ED$89),\"zzz\")","v":"zzz"},null,0,{"$f":"IFERROR(LOOKUP(1, 1/((COUNTIF(AN$70:AN98, EE$4:EE$89)=0)*(EE$4:EE$89<>\"\")), EE$4:EE$89),\"zzz\")","v":"zzz"},null,0,{"$f":"IFERROR(LOOKUP(1, 1/((COUNTIF(AQ$70:AQ98, EF$4:EF$89)=0)*(EF$4:EF$89<>\"\")), EF$4:EF$89),\"zzz\")","v":"zzz"},null,0,null,null,0,null,null,0,null,null,0,null,null,0,null,null,0]
[null,null,null,null,null,null,null,null,null,null,null,null,null,null,null,null,null,null,null,null,null,null,null,null,null,null,30,null,null,null,{"$f":"IFERROR(LOOKUP(1, 1/((COUNTIF(AE$70:AE99, EB$4:EB$89)=0)*(EB$4:EB$89<>\"\")), EB$4:EB$89),\"zzz\")","v":"zzz"},null,0,{"$f":"IFERROR(LOOKUP(1, 1/((COUNTIF(AH$70:AH99, EC$4:EC$89)=0)*(EC$4:EC$89<>\"\")), EC$4:EC$89),\"zzz\")","v":"zzz"},null,0,{"$f":"IFERROR(LOOKUP(1, 1/((COUNTIF(AK$70:AK99, ED$4:ED$89)=0)*(ED$4:ED$89<>\"\")), ED$4:ED$89),\"zzz\")","v":"zzz"},null,0,{"$f":"IFERROR(LOOKUP(1, 1/((COUNTIF(AN$70:AN99, EE$4:EE$89)=0)*(EE$4:EE$89<>\"\")), EE$4:EE$89),\"zzz\")","v":"zzz"},null,0,{"$f":"IFERROR(LOOKUP(1, 1/((COUNTIF(AQ$70:AQ99, EF$4:EF$89)=0)*(EF$4:EF$89<>\"\")), EF$4:EF$89),\"zzz\")","v":"zzz"},null,0,null,null,0,null,null,0,null,null,0,null,null,0,null,null,0]
[null,null,null,null,null,null,null,null,null,null,null,null,null,null,null,null,null,null,null,null,null,null,null,null,null,null,31,null,null,null,{"$f":"IFERROR(LOOKUP(1, 1/((COUNTIF(AE$70:AE100, EB$4:EB$89)=0)*(EB$4:EB$89<>\"\")), EB$4:EB$89),\"zzz\")","v":"zzz"},null,0,{"$f":"IFERROR(LOOKUP(1, 1/((COUNTIF(AH$70:AH100, EC$4:EC$89)=0)*(EC$4:EC$89<>\"\")), EC$4:EC$89),\"zzz\")","v":"zzz"},null,0,{"$f":"IFERROR(LOOKUP(1, 1/((COUNTIF(AK$70:AK100, ED$4:ED$89)=0)*(ED$4:ED$89<>\"\")), ED$4:ED$89),\"zzz\")","v":"zzz"},null,0,{"$f":"IFERROR(LOOKUP(1, 1/((COUNTIF(AN$70:AN100, EE$4:EE$89)=0)*(EE$4:EE$89<>\"\")), EE$4:EE$89),\"zzz\")","v":"zzz"},null,0,{"$f":"IFERROR(LOOKUP(1, 1/((COUNTIF(AQ$70:AQ100, EF$4:EF$89)=0)*(EF$4:EF$89<>\"\")), EF$4:EF$89),\"zzz\")","v":"zzz"},null,0,null,null,0,null,null,0,null,null,0,null,null,0,null,null,0]
[null,null,null,null,null,null,null,null,null,null,null,null,null,null,null,null,null,null,null,null,null,null,null,null,null,null,32,null,null,null,{"$f":"IFERROR(LOOKUP(1, 1/((COUNTIF(AE$70:AE101, EB$4:EB$89)=0)*(EB$4:EB$89<>\"\")), EB$4:EB$89),\"zzz\")","v":"zzz"},null,0,{"$f":"IFERROR(LOOKUP(1, 1/((COUNTIF(AH$70:AH101, EC$4:EC$89)=0)*(EC$4:EC$89<>\"\")), EC$4:EC$89),\"zzz\")","v":"zzz"},null,0,{"$f":"IFERROR(LOOKUP(1, 1/((COUNTIF(AK$70:AK101, ED$4:ED$89)=0)*(ED$4:ED$89<>\"\")), ED$4:ED$89),\"zzz\")","v":"zzz"},null,0,{"$f":"IFERROR(LOOKUP(1, 1/((COUNTIF(AN$70:AN101, EE$4:EE$89)=0)*(EE$4:EE$89<>\"\")), EE$4:EE$89),\"zzz\")","v":"zzz"},null,0,{"$f":"IFERROR(LOOKUP(1, 1/((COUNTIF(AQ$70:AQ101, EF$4:EF$89)=0)*(EF$4:EF$89<>\"\")), EF$4:EF$89),\"zzz\")","v":"zzz"},null,0,null,null,0,null,null,0,null,null,0,null,null,0,null,null,0]
[null,null,null,null,null,null,null,null,null,null,null,null,null,null,null,null,null,null,null,null,null,null,null,null,null,null,33,null,null,null,{"$f":"IFERROR(LOOKUP(1, 1/((COUNTIF(AE$70:AE102, EB$4:EB$89)=0)*(EB$4:EB$89<>\"\")), EB$4:EB$89),\"zzz\")","v":"zzz"},null,0,{"$f":"IFERROR(LOOKUP(1, 1/((COUNTIF(AH$70:AH102, EC$4:EC$89)=0)*(EC$4:EC$89<>\"\")), EC$4:EC$89),\"zzz\")","v":"zzz"},null,0,{"$f":"IFERROR(LOOKUP(1, 1/((COUNTIF(AK$70:AK102, ED$4:ED$89)=0)*(ED$4:ED$89<>\"\")), ED$4:ED$89),\"zzz\")","v":"zzz"},null,0,{"$f":"IFERROR(LOOKUP(1, 1/((COUNTIF(AN$70:AN102, EE$4:EE$89)=0)*(EE$4:EE$89<>\"\")), EE$4:EE$89),\"zzz\")","v":"zzz"},null,0,{"$f":"IFERROR(LOOKUP(1, 1/((COUNTIF(AQ$70:AQ102, EF$4:EF$89)=0)*(EF$4:EF$89<>\"\")), EF$4:EF$89),\"zzz\")","v":"zzz"},null,0,null,null,0,null,null,0,null,null,0,null,null,0,null,null,0]
[null,null,null,null,null,null,null,null,null,null,null,null,null,null,null,null,null,null,null,null,null,null,null,null,null,null,34,null,null,null,{"$f":"IFERROR(LOOKUP(1, 1/((COUNTIF(AE$70:AE103, EB$4:EB$89)=0)*(EB$4:EB$89<>\"\")), EB$4:EB$89),\"zzz\")","v":"zzz"},null,0,{"$f":"IFERROR(LOOKUP(1, 1/((COUNTIF(AH$70:AH103, EC$4:EC$89)=0)*(EC$4:EC$89<>\"\")), EC$4:EC$89),\"zzz\")","v":"zzz"},null,0,{"$f":"IFERROR(LOOKUP(1, 1/((COUNTIF(AK$70:AK103, ED$4:ED$89)=0)*(ED$4:ED$89<>\"\")), ED$4:ED$89),\"zzz\")","v":"zzz"},null,0,{"$f":"IFERROR(LOOKUP(1, 1/((COUNTIF(AN$70:AN103, EE$4:EE$89)=0)*(EE$4:EE$89<>\"\")), EE$4:EE$89),\"zzz\")","v":"zzz"},null,0,{"$f":"IFERROR(LOOKUP(1, 1/((COUNTIF(AQ$70:AQ103, EF$4:EF$89)=0)*(EF$4:EF$89<>\"\")), EF$4:EF$89),\"zzz\")","v":"zzz"},null,0,null,null,0,null,null,0,null,null,0,null,null,0,null,null,0]
[null,null,null,null,null,null,null,null,null,null,null,null,null,null,null,null,null,null,null,null,null,null,null,null,null,null,35,null,null,null,{"$f":"IFERROR(LOOKUP(1, 1/((COUNTIF(AE$70:AE104, EB$4:EB$89)=0)*(EB$4:EB$89<>\"\")), EB$4:EB$89),\"zzz\")","v":"zzz"},null,0,{"$f":"IFERROR(LOOKUP(1, 1/((COUNTIF(AH$70:AH104, EC$4:EC$89)=0)*(EC$4:EC$89<>\"\")), EC$4:EC$89),\"zzz\")","v":"zzz"},null,0,{"$f":"IFERROR(LOOKUP(1, 1/((COUNTIF(AK$70:AK104, ED$4:ED$89)=0)*(ED$4:ED$89<>\"\")), ED$4:ED$89),\"zzz\")","v":"zzz"},null,0,{"$f":"IFERROR(LOOKUP(1, 1/((COUNTIF(AN$70:AN104, EE$4:EE$89)=0)*(EE$4:EE$89<>\"\")), EE$4:EE$89),\"zzz\")","v":"zzz"},null,0,{"$f":"IFERROR(LOOKUP(1, 1/((COUNTIF(AQ$70:AQ104, EF$4:EF$89)=0)*(EF$4:EF$89<>\"\")), EF$4:EF$89),\"zzz\")","v":"zzz"},null,0,null,null,0,null,null,0,null,null,0,null,null,0,null,null,0]
[null,null,null,null,null,null,null,null,null,null,null,null,null,null,null,null,null,null,null,null,null,null,null,null,null,null,36,null,null,null,{"$f":"IFERROR(LOOKUP(1, 1/((COUNTIF(AE$70:AE105, EB$4:EB$89)=0)*(EB$4:EB$89<>\"\")), EB$4:EB$89),\"zzz\")","v":"zzz"},null,0,{"$f":"IFERROR(LOOKUP(1, 1/((COUNTIF(AH$70:AH105, EC$4:EC$89)=0)*(EC$4:EC$89<>\"\")), EC$4:EC$89),\"zzz\")","v":"zzz"},null,0,{"$f":"IFERROR(LOOKUP(1, 1/((COUNTIF(AK$70:AK105, ED$4:ED$89)=0)*(ED$4:ED$89<>\"\")), ED$4:ED$89),\"zzz\")","v":"zzz"},null,0,{"$f":"IFERROR(LOOKUP(1, 1/((COUNTIF(AN$70:AN105, EE$4:EE$89)=0)*(EE$4:EE$89<>\"\")), EE$4:EE$89),\"zzz\")","v":"zzz"},null,0,{"$f":"IFERROR(LOOKUP(1, 1/((COUNTIF(AQ$70:AQ105, EF$4:EF$89)=0)*(EF$4:EF$89<>\"\")), EF$4:EF$89),\"zzz\")","v":"zzz"},null,0,null,null,0,null,null,0,null,null,0,null,null,0,null,null,0]
[null,null,null,null,null,null,null,null,null,null,null,null,null,null,null,null,null,null,null,null,null,null,null,null,null,null,37,null,null,null,{"$f":"IFERROR(LOOKUP(1, 1/((COUNTIF(AE$70:AE106, EB$4:EB$89)=0)*(EB$4:EB$89<>\"\")), EB$4:EB$89),\"zzz\")","v":"zzz"},null,0,{"$f":"IFERROR(LOOKUP(1, 1/((COUNTIF(AH$70:AH106, EC$4:EC$89)=0)*(EC$4:EC$89<>\"\")), EC$4:EC$89),\"zzz\")","v":"zzz"},null,0,{"$f":"IFERROR(LOOKUP(1, 1/((COUNTIF(AK$70:AK106, ED$4:ED$89)=0)*(ED$4:ED$89<>\"\")), ED$4:ED$89),\"zzz\")","v":"zzz"},null,0,{"$f":"IFERROR(LOOKUP(1, 1/((COUNTIF(AN$70:AN106, EE$4:EE$89)=0)*(EE$4:EE$89<>\"\")), EE$4:EE$89),\"zzz\")","v":"zzz"},null,0,{"$f":"IFERROR(LOOKUP(1, 1/((COUNTIF(AQ$70:AQ106, EF$4:EF$89)=0)*(EF$4:EF$89<>\"\")), EF$4:EF$89),\"zzz\")","v":"zzz"},null,0,null,null,0,null,null,0,null,null,0,null,null,0,null,null,0]
[null,null,null,null,null,null,null,null,null,null,null,null,null,null,null,null,null,null,null,null,null,null,null,null,null,null,38,null,null,null,{"$f":"IFERROR(LOOKUP(1, 1/((COUNTIF(AE$70:AE107, EB$4:EB$89)=0)*(EB$4:EB$89<>\"\")), EB$4:EB$89),\"zzz\")","v":"zzz"},null,0,{"$f":"IFERROR(LOOKUP(1, 1/((COUNTIF(AH$70:AH107, EC$4:EC$89)=0)*(EC$4:EC$89<>\"\")), EC$4:EC$89),\"zzz\")","v":"zzz"},null,0,{"$f":"IFERROR(LOOKUP(1, 1/((COUNTIF(AK$70:AK107, ED$4:ED$89)=0)*(ED$4:ED$89<>\"\")), ED$4:ED$89),\"zzz\")","v":"zzz"},null,0,{"$f":"IFERROR(LOOKUP(1, 1/((COUNTIF(AN$70:AN107, EE$4:EE$89)=0)*(EE$4:EE$89<>\"\")), EE$4:EE$89),\"zzz\")","v":"zzz"},null,0,{"$f":"IFERROR(LOOKUP(1, 1/((COUNTIF(AQ$70:AQ107, EF$4:EF$89)=0)*(EF$4:EF$89<>\"\")), EF$4:EF$89),\"zzz\")","v":"zzz"},null,0,null,null,0,null,null,0,null,null,0,null,null,0,null,null,0]
[null,null,null,null,null,null,null,null,null,null,null,null,null,null,null,null,null,null,null,null,null,null,null,null,null,null,39,null,null,null,{"$f":"IFERROR(LOOKUP(1, 1/((COUNTIF(AE$70:AE108, EB$4:EB$89)=0)*(EB$4:EB$89<>\"\")), EB$4:EB$89),\"zzz\")","v":"zzz"},null,0,{"$f":"IFERROR(LOOKUP(1, 1/((COUNTIF(AH$70:AH108, EC$4:EC$89)=0)*(EC$4:EC$89<>\"\")), EC$4:EC$89),\"zzz\")","v":"zzz"},null,0,{"$f":"IFERROR(LOOKUP(1, 1/((COUNTIF(AK$70:AK108, ED$4:ED$89)=0)*(ED$4:ED$89<>\"\")), ED$4:ED$89),\"zzz\")","v":"zzz"},null,0,{"$f":"IFERROR(LOOKUP(1, 1/((COUNTIF(AN$70:AN108, EE$4:EE$89)=0)*(EE$4:EE$89<>\"\")), EE$4:EE$89),\"zzz\")","v":"zzz"},null,0,{"$f":"IFERROR(LOOKUP(1, 1/((COUNTIF(AQ$70:AQ108, EF$4:EF$89)=0)*(EF$4:EF$89<>\"\")), EF$4:EF$89),\"zzz\")","v":"zzz"},null,0,null,null,0,null,null,0,null,null,0,null,null,0,null,null,0]
[null,null,null,null,null,null,null,null,null,null,null,null,null,null,null,null,null,null,null,null,null,null,null,null,null,null,40,null,null,null,{"$f":"IFERROR(LOOKUP(1, 1/((COUNTIF(AE$70:AE109, EB$4:EB$89)=0)*(EB$4:EB$89<>\"\")), EB$4:EB$89),\"zzz\")","v":"zzz"},null,0,{"$f":"IFERROR(LOOKUP(1, 1/((COUNTIF(AH$70:AH109, EC$4:EC$89)=0)*(EC$4:EC$89<>\"\")), EC$4:EC$89),\"zzz\")","v":"zzz"},null,0,{"$f":"IFERROR(LOOKUP(1, 1/((COUNTIF(AK$70:AK109, ED$4:ED$89)=0)*(ED$4:ED$89<>\"\")), ED$4:ED$89),\"zzz\")","v":"zzz"},null,0,{"$f":"IFERROR(LOOKUP(1, 1/((COUNTIF(AN$70:AN109, EE$4:EE$89)=0)*(EE$4:EE$89<>\"\")), EE$4:EE$89),\"zzz\")","v":"zzz"},null,0,{"$f":"IFERROR(LOOKUP(1, 1/((COUNTIF(AQ$70:AQ109, EF$4:EF$89)=0)*(EF$4:EF$89<>\"\")), EF$4:EF$89),\"zzz\")","v":"zzz"},null,0,null,null,0,null,null,0,null,null,0,null,null,0,null,null,0]
[null,null,null,null,null,null,null,null,null,null,null,null,null,null,null,null,null,null,null,null,null,null,null,null,null,null,41,null,null,null,{"$f":"IFERROR(LOOKUP(1, 1/((COUNTIF(AE$70:AE110, EB$4:EB$89)=0)*(EB$4:EB$89<>\"\")), EB$4:EB$89),\"zzz\")","v":"zzz"},null,0,{"$f":"IFERROR(LOOKUP(1, 1/((COUNTIF(AH$70:AH110, EC$4:EC$89)=0)*(EC$4:EC$89<>\"\")), EC$4:EC$89),\"zzz\")","v":"zzz"},null,0,{"$f":"IFERROR(LOOKUP(1, 1/((COUNTIF(AK$70:AK110, ED$4:ED$89)=0)*(ED$4:ED$89<>\"\")), ED$4:ED$89),\"zzz\")","v":"zzz"},null,0,{"$f":"IFERROR(LOOKUP(1, 1/((COUNTIF(AN$70:AN110, EE$4:EE$89)=0)*(EE$4:EE$89<>\"\")), EE$4:EE$89),\"zzz\")","v":"zzz"},null,0,{"$f":"IFERROR(LOOKUP(1, 1/((COUNTIF(AQ$70:AQ110, EF$4:EF$89)=0)*(EF$4:EF$89<>\"\")), EF$4:EF$89),\"zzz\")","v":"zzz"},null,0,null,null,0,null,null,0,null,null,0,null,null,0,null,null,0]
[null,null,null,null,null,null,null,null,null,null,null,null,null,null,null,null,null,null,null,null,null,null,null,null,null,null,42,null,null,null,{"$f":"IFERROR(LOOKUP(1, 1/((COUNTIF(AE$70:AE111, EB$4:EB$89)=0)*(EB$4:EB$89<>\"\")), EB$4:EB$89),\"zzz\")","v":"zzz"},null,0,{"$f":"IFERROR(LOOKUP(1, 1/((COUNTIF(AH$70:AH111, EC$4:EC$89)=0)*(EC$4:EC$89<>\"\")), EC$4:EC$89),\"zzz\")","v":"zzz"},null,0,{"$f":"IFERROR(LOOKUP(1, 1/((COUNTIF(AK$70:AK111, ED$4:ED$89)=0)*(ED$4:ED$89<>\"\")), ED$4:ED$89),\"zzz\")","v":"zzz"},null,0,{"$f":"IFERROR(LOOKUP(1, 1/((COUNTIF(AN$70:AN111, EE$4:EE$89)=0)*(EE$4:EE$89<>\"\")), EE$4:EE$89),\"zzz\")","v":"zzz"},null,0,{"$f":"IFERROR(LOOKUP(1, 1/((COUNTIF(AQ$70:AQ111, EF$4:EF$89)=0)*(EF$4:EF$89<>\"\")), EF$4:EF$89),\"zzz\")","v":"zzz"},null,0,null,null,0,null,null,0,null,null,0,null,null,0,null,null,0]
[null,null,null,null,null,null,null,null,null,null,null,null,null,null,null,null,null,null,null,null,null,null,null,null,null,null,43,null,null,null,{"$f":"IFERROR(LOOKUP(1, 1/((COUNTIF(AE$70:AE112, EB$4:EB$89)=0)*(EB$4:EB$89<>\"\")), EB$4:EB$89),\"zzz\")","v":"zzz"},null,0,{"$f":"IFERROR(LOOKUP(1, 1/((COUNTIF(AH$70:AH112, EC$4:EC$89)=0)*(EC$4:EC$89<>\"\")), EC$4:EC$89),\"zzz\")","v":"zzz"},null,0,{"$f":"IFERROR(LOOKUP(1, 1/((COUNTIF(AK$70:AK112, ED$4:ED$89)=0)*(ED$4:ED$89<>\"\")), ED$4:ED$89),\"zzz\")","v":"zzz"},null,0,{"$f":"IFERROR(LOOKUP(1, 1/((COUNTIF(AN$70:AN112, EE$4:EE$89)=0)*(EE$4:EE$89<>\"\")), EE$4:EE$89),\"zzz\")","v":"zzz"},null,0,{"$f":"IFERROR(LOOKUP(1, 1/((COUNTIF(AQ$70:AQ112, EF$4:EF$89)=0)*(EF$4:EF$89<>\"\")), EF$4:EF$89),\"zzz\")","v":"zzz"},null,0,null,null,0,null,null,0,null,null,0,null,null,0,null,null,0]
[null,null,null,null,null,null,null,null,null,null,null,null,null,null,null,null,null,null,null,null,null,null,null,null,null,null,44,null,null,null,{"$f":"IFERROR(LOOKUP(1, 1/((COUNTIF(AE$70:AE113, EB$4:EB$89)=0)*(EB$4:EB$89<>\"\")), EB$4:EB$89),\"zzz\")","v":"zzz"},null,0,{"$f":"IFERROR(LOOKUP(1, 1/((COUNTIF(AH$70:AH113, EC$4:EC$89)=0)*(EC$4:EC$89<>\"\")), EC$4:EC$89),\"zzz\")","v":"zzz"},null,0,{"$f":"IFERROR(LOOKUP(1, 1/((COUNTIF(AK$70:AK113, ED$4:ED$89)=0)*(ED$4:ED$89<>\"\")), ED$4:ED$89),\"zzz\")","v":"zzz"},null,0,{"$f":"IFERROR(LOOKUP(1, 1/((COUNTIF(AN$70:AN113, EE$4:EE$89)=0)*(EE$4:EE$89<>\"\")), EE$4:EE$89),\"zzz\")","v":"zzz"},null,0,{"$f":"IFERROR(LOOKUP(1, 1/((COUNTIF(AQ$70:AQ113, EF$4:EF$89)=0)*(EF$4:EF$89<>\"\")), EF$4:EF$89),\"zzz\")","v":"zzz"},null,0,null,null,0,null,null,0,null,null,0,null,null,0,null,null,0]
[null,null,null,null,null,null,null,null,null,null,null,null,null,null,null,null,null,null,null,null,null,null,null,null,null,null,45,null,null,null,{"$f":"IFERROR(LOOKUP(1, 1/((COUNTIF(AE$70:AE114, EB$4:EB$89)=0)*(EB$4:EB$89<>\"\")), EB$4:EB$89),\"zzz\")","v":"zzz"},null,0,{"$f":"IFERROR(LOOKUP(1, 1/((COUNTIF(AH$70:AH114, EC$4:EC$89)=0)*(EC$4:EC$89<>\"\")), EC$4:EC$89),\"zzz\")","v":"zzz"},null,0,{"$f":"IFERROR(LOOKUP(1, 1/((COUNTIF(AK$70:AK114, ED$4:ED$89)=0)*(ED$4:ED$89<>\"\")), ED$4:ED$89),\"zzz\")","v":"zzz"},null,0,{"$f":"IFERROR(LOOKUP(1, 1/((COUNTIF(AN$70:AN114, EE$4:EE$89)=0)*(EE$4:EE$89<>\"\")), EE$4:EE$89),\"zzz\")","v":"zzz"},null,0,{"$f":"IFERROR(LOOKUP(1, 1/((COUNTIF(AQ$70:AQ114, EF$4:EF$89)=0)*(EF$4:EF$89<>\"\")), EF$4:EF$89),\"zzz\")","v":"zzz"},null,0,null,null,0,null,null,0,null,null,0,null,null,0,null,null,0]
[null,null,null,null,null,null,null,null,null,null,null,null,null,null,null,null,null,null,null,null,null,null,null,null,null,null,46,null,null,null,{"$f":"IFERROR(LOOKUP(1, 1/((COUNTIF(AE$70:AE115, EB$4:EB$89)=0)*(EB$4:EB$89<>\"\")), EB$4:EB$89),\"zzz\")","v":"zzz"},null,0,{"$f":"IFERROR(LOOKUP(1, 1/((COUNTIF(AH$70:AH115, EC$4:EC$89)=0)*(EC$4:EC$89<>\"\")), EC$4:EC$89),\"zzz\")","v":"zzz"},null,0,{"$f":"IFERROR(LOOKUP(1, 1/((COUNTIF(AK$70:AK115, ED$4:ED$89)=0)*(ED$4:ED$89<>\"\")), ED$4:ED$89),\"zzz\")","v":"zzz"},null,0,{"$f":"IFERROR(LOOKUP(1, 1/((COUNTIF(AN$70:AN115, EE$4:EE$89)=0)*(EE$4:EE$89<>\"\")), EE$4:EE$89),\"zzz\")","v":"zzz"},null,0,{"$f":"IFERROR(LOOKUP(1, 1/((COUNTIF(AQ$70:AQ115, EF$4:EF$89)=0)*(EF$4:EF$89<>\"\")), EF$4:EF$89),\"zzz\")","v":"zzz"},null,0,null,null,0,null,null,0,null,null,0,null,null,0,null,null,0]
[null,null,null,null,null,null,null,null,null,null,null,null,null,null,null,null,null,null,null,null,null,null,null,null,null,null,47,null,null,null,{"$f":"IFERROR(LOOKUP(1, 1/((COUNTIF(AE$70:AE116, EB$4:EB$89)=0)*(EB$4:EB$89<>\"\")), EB$4:EB$89),\"zzz\")","v":"zzz"},null,0,{"$f":"IFERROR(LOOKUP(1, 1/((COUNTIF(AH$70:AH116, EC$4:EC$89)=0)*(EC$4:EC$89<>\"\")), EC$4:EC$89),\"zzz\")","v":"zzz"},null,0,{"$f":"IFERROR(LOOKUP(1, 1/((COUNTIF(AK$70:AK116, ED$4:ED$89)=0)*(ED$4:ED$89<>\"\")), ED$4:ED$89),\"zzz\")","v":"zzz"},null,0,{"$f":"IFERROR(LOOKUP(1, 1/((COUNTIF(AN$70:AN116, EE$4:EE$89)=0)*(EE$4:EE$89<>\"\")), EE$4:EE$89),\"zzz\")","v":"zzz"},null,0,{"$f":"IFERROR(LOOKUP(1, 1/((COUNTIF(AQ$70:AQ116, EF$4:EF$89)=0)*(EF$4:EF$89<>\"\")), EF$4:EF$89),\"zzz\")","v":"zzz"},null,0,null,null,0,null,null,0,null,null,0,null,null,0,null,null,0]
[null,null,null,null,null,null,null,null,null,null,null,null,null,null,null,null,null,null,null,null,null,null,null,null,null,null,48,null,null,null,{"$f":"IFERROR(LOOKUP(1, 1/((COUNTIF(AE$70:AE117, EB$4:EB$89)=0)*(EB$4:EB$89<>\"\")), EB$4:EB$89),\"zzz\")","v":"zzz"},null,0,{"$f":"IFERROR(LOOKUP(1, 1/((COUNTIF(AH$70:AH117, EC$4:EC$89)=0)*(EC$4:EC$89<>\"\")), EC$4:EC$89),\"zzz\")","v":"zzz"},null,0,{"$f":"IFERROR(LOOKUP(1, 1/((COUNTIF(AK$70:AK117, ED$4:ED$89)=0)*(ED$4:ED$89<>\"\")), ED$4:ED$89),\"zzz\")","v":"zzz"},null,0,{"$f":"IFERROR(LOOKUP(1, 1/((COUNTIF(AN$70:AN117, EE$4:EE$89)=0)*(EE$4:EE$89<>\"\")), EE$4:EE$89),\"zzz\")","v":"zzz"},null,0,{"$f":"IFERROR(LOOKUP(1, 1/((COUNTIF(AQ$70:AQ117, EF$4:EF$89)=0)*(EF$4:EF$89<>\"\")), EF$4:EF$89),\"zzz\")","v":"zzz"},null,0,null,null,0,null,null,0,null,null,0,null,null,0,null,null,0]
[null,null,null,null,null,null,null,null,null,null,null,null,null,null,null,null,null,null,null,null,null,null,null,null,null,null,49,null,null,null,{"$f":"IFERROR(LOOKUP(1, 1/((COUNTIF(AE$70:AE118, EB$4:EB$89)=0)*(EB$4:EB$89<>\"\")), EB$4:EB$89),\"zzz\")","v":"zzz"},null,0,{"$f":"IFERROR(LOOKUP(1, 1/((COUNTIF(AH$70:AH118, EC$4:EC$89)=0)*(EC$4:EC$89<>\"\")), EC$4:EC$89),\"zzz\")","v":"zzz"},null,0,{"$f":"IFERROR(LOOKUP(1, 1/((COUNTIF(AK$70:AK118, ED$4:ED$89)=0)*(ED$4:ED$89<>\"\")), ED$4:ED$89),\"zzz\")","v":"zzz"},null,0,{"$f":"IFERROR(LOOKUP(1, 1/((COUNTIF(AN$70:AN118, EE$4:EE$89)=0)*(EE$4:EE$89<>\"\")), EE$4:EE$89),\"zzz\")","v":"zzz"},null,0,{"$f":"IFERROR(LOOKUP(1, 1/((COUNTIF(AQ$70:AQ118, EF$4:EF$89)=0)*(EF$4:EF$89<>\"\")), EF$4:EF$89),\"zzz\")","v":"zzz"},null,0,null,null,0,null,null,0,null,null,0,null,null,0,null,null,0]
[null,null,null,null,null,null,null,null,null,null,null,null,null,null,null,null,null,null,null,null,null,null,null,null,null,null,50,null,null,null,{"$f":"IFERROR(LOOKUP(1, 1/((COUNTIF(AE$70:AE119, EB$4:EB$89)=0)*(EB$4:EB$89<>\"\")), EB$4:EB$89),\"zzz\")","v":"zzz"},null,0,{"$f":"IFERROR(LOOKUP(1, 1/((COUNTIF(AH$70:AH119, EC$4:EC$89)=0)*(EC$4:EC$89<>\"\")), EC$4:EC$89),\"zzz\")","v":"zzz"},null,0,{"$f":"IFERROR(LOOKUP(1, 1/((COUNTIF(AK$70:AK119, ED$4:ED$89)=0)*(ED$4:ED$89<>\"\")), ED$4:ED$89),\"zzz\")","v":"zzz"},null,0,{"$f":"IFERROR(LOOKUP(1, 1/((COUNTIF(AN$70:AN119, EE$4:EE$89)=0)*(EE$4:EE$89<>\"\")), EE$4:EE$89),\"zzz\")","v":"zzz"},null,0,{"$f":"IFERROR(LOOKUP(1, 1/((COUNTIF(AQ$70:AQ119, EF$4:EF$89)=0)*(EF$4:EF$89<>\"\")), EF$4:EF$89),\"zzz\")","v":"zzz"},null,0,null,null,0,null,null,0,null,null,0,null,null,0,null,null,0]
[null,null,null,null,null,null,null,null,null,null,null,null,null,null,null,null,null,null,null,null,null,null,null,null,null,null,51,null,null,null,{"$f":"IFERROR(LOOKUP(1, 1/((COUNTIF(AE$70:AE120, EB$4:EB$89)=0)*(EB$4:EB$89<>\"\")), EB$4:EB$89),\"zzz\")","v":"zzz"},null,0,{"$f":"IFERROR(LOOKUP(1, 1/((COUNTIF(AH$70:AH120, EC$4:EC$89)=0)*(EC$4:EC$89<>\"\")), EC$4:EC$89),\"zzz\")","v":"zzz"},null,0,{"$f":"IFERROR(LOOKUP(1, 1/((COUNTIF(AK$70:AK120, ED$4:ED$89)=0)*(ED$4:ED$89<>\"\")), ED$4:ED$89),\"zzz\")","v":"zzz"},null,0,{"$f":"IFERROR(LOOKUP(1, 1/((COUNTIF(AN$70:AN120, EE$4:EE$89)=0)*(EE$4:EE$89<>\"\")), EE$4:EE$89),\"zzz\")","v":"zzz"},null,0,{"$f":"IFERROR(LOOKUP(1, 1/((COUNTIF(AQ$70:AQ120, EF$4:EF$89)=0)*(EF$4:EF$89<>\"\")), EF$4:EF$89),\"zzz\")","v":"zzz"},null,0,null,null,0,null,null,0,null,null,0,null,null,0,null,null,0]
[null,null,null,null,null,null,null,null,null,null,null,null,null,null,null,null,null,null,null,null,null,null,null,null,null,null,52,null,null,null,{"$f":"IFERROR(LOOKUP(1, 1/((COUNTIF(AE$70:AE121, EB$4:EB$89)=0)*(EB$4:EB$89<>\"\")), EB$4:EB$89),\"zzz\")","v":"zzz"},null,0,{"$f":"IFERROR(LOOKUP(1, 1/((COUNTIF(AH$70:AH121, EC$4:EC$89)=0)*(EC$4:EC$89<>\"\")), EC$4:EC$89),\"zzz\")","v":"zzz"},null,0,{"$f":"IFERROR(LOOKUP(1, 1/((COUNTIF(AK$70:AK121, ED$4:ED$89)=0)*(ED$4:ED$89<>\"\")), ED$4:ED$89),\"zzz\")","v":"zzz"},null,0,{"$f":"IFERROR(LOOKUP(1, 1/((COUNTIF(AN$70:AN121, EE$4:EE$89)=0)*(EE$4:EE$89<>\"\")), EE$4:EE$89),\"zzz\")","v":"zzz"},null,0,{"$f":"IFERROR(LOOKUP(1, 1/((COUNTIF(AQ$70:AQ121, EF$4:EF$89)=0)*(EF$4:EF$89<>\"\")), EF$4:EF$89),\"zzz\")","v":"zzz"},null,0,null,null,0,null,null,0,null,null,0,null,null,0,null,null,0]
[null,null,null,null,null,null,null,null,null,null,null,null,null,null,null,null,null,null,null,null,null,null,null,null,null,null,53,null,null,null,{"$f":"IFERROR(LOOKUP(1, 1/((COUNTIF(AE$70:AE122, EB$4:EB$89)=0)*(EB$4:EB$89<>\"\")), EB$4:EB$89),\"zzz\")","v":"zzz"},null,0,{"$f":"IFERROR(LOOKUP(1, 1/((COUNTIF(AH$70:AH122, EC$4:EC$89)=0)*(EC$4:EC$89<>\"\")), EC$4:EC$89),\"zzz\")","v":"zzz"},null,0,{"$f":"IFERROR(LOOKUP(1, 1/((COUNTIF(AK$70:AK122, ED$4:ED$89)=0)*(ED$4:ED$89<>\"\")), ED$4:ED$89),\"zzz\")","v":"zzz"},null,0,{"$f":"IFERROR(LOOKUP(1, 1/((COUNTIF(AN$70:AN122, EE$4:EE$89)=0)*(EE$4:EE$89<>\"\")), EE$4:EE$89),\"zzz\")","v":"zzz"},null,0,{"$f":"IFERROR(LOOKUP(1, 1/((COUNTIF(AQ$70:AQ122, EF$4:EF$89)=0)*(EF$4:EF$89<>\"\")), EF$4:EF$89),\"zzz\")","v":"zzz"},null,0,null,null,0,null,null,0,null,null,0,null,null,0,null,null,0]
[null,null,null,null,null,null,null,null,null,null,null,null,null,null,null,null,null,null,null,null,null,null,null,null,null,null,54,null,null,null,{"$f":"IFERROR(LOOKUP(1, 1/((COUNTIF(AE$70:AE123, EB$4:EB$89)=0)*(EB$4:EB$89<>\"\")), EB$4:EB$89),\"zzz\")","v":"zzz"},null,0,{"$f":"IFERROR(LOOKUP(1, 1/((COUNTIF(AH$70:AH123, EC$4:EC$89)=0)*(EC$4:EC$89<>\"\")), EC$4:EC$89),\"zzz\")","v":"zzz"},null,0,{"$f":"IFERROR(LOOKUP(1, 1/((COUNTIF(AK$70:AK123, ED$4:ED$89)=0)*(ED$4:ED$89<>\"\")), ED$4:ED$89),\"zzz\")","v":"zzz"},null,0,{"$f":"IFERROR(LOOKUP(1, 1/((COUNTIF(AN$70:AN123, EE$4:EE$89)=0)*(EE$4:EE$89<>\"\")), EE$4:EE$89),\"zzz\")","v":"zzz"},null,0,{"$f":"IFERROR(LOOKUP(1, 1/((COUNTIF(AQ$70:AQ123, EF$4:EF$89)=0)*(EF$4:EF$89<>\"\")), EF$4:EF$89),\"zzz\")","v":"zzz"},null,0,null,null,0,null,null,0,null,null,0,null,null,0,null,null,0]
[null,null,null,null,null,null,null,null,null,null,null,null,null,null,null,null,null,null,null,null,null,null,null,null,null,null,55,null,null,null,{"$f":"IFERROR(LOOKUP(1, 1/((COUNTIF(AE$70:AE124, EB$4:EB$89)=0)*(EB$4:EB$89<>\"\")), EB$4:EB$89),\"zzz\")","v":"zzz"},null,0,{"$f":"IFERROR(LOOKUP(1, 1/((COUNTIF(AH$70:AH124, EC$4:EC$89)=0)*(EC$4:EC$89<>\"\")), EC$4:EC$89),\"zzz\")","v":"zzz"},null,0,{"$f":"IFERROR(LOOKUP(1, 1/((COUNTIF(AK$70:AK124, ED$4:ED$89)=0)*(ED$4:ED$89<>\"\")), ED$4:ED$89),\"zzz\")","v":"zzz"},null,0,{"$f":"IFERROR(LOOKUP(1, 1/((COUNTIF(AN$70:AN124, EE$4:EE$89)=0)*(EE$4:EE$89<>\"\")), EE$4:EE$89),\"zzz\")","v":"zzz"},null,0,{"$f":"IFERROR(LOOKUP(1, 1/((COUNTIF(AQ$70:AQ124, EF$4:EF$89)=0)*(EF$4:EF$89<>\"\")), EF$4:EF$89),\"zzz\")","v":"zzz"},null,0,null,null,0,null,null,0,null,null,0,null,null,0,null,null,0]
[null,null,null,null,null,null,null,null,null,null,null,null,null,null,null,null,null,null,null,null,null,null,null,null,null,null,56,null,null,null,{"$f":"IFERROR(LOOKUP(1, 1/((COUNTIF(AE$70:AE125, EB$4:EB$89)=0)*(EB$4:EB$89<>\"\")), EB$4:EB$89),\"zzz\")","v":"zzz"},null,0,{"$f":"IFERROR(LOOKUP(1, 1/((COUNTIF(AH$70:AH125, EC$4:EC$89)=0)*(EC$4:EC$89<>\"\")), EC$4:EC$89),\"zzz\")","v":"zzz"},null,0,{"$f":"IFERROR(LOOKUP(1, 1/((COUNTIF(AK$70:AK125, ED$4:ED$89)=0)*(ED$4:ED$89<>\"\")), ED$4:ED$89),\"zzz\")","v":"zzz"},null,0,{"$f":"IFERROR(LOOKUP(1, 1/((COUNTIF(AN$70:AN125, EE$4:EE$89)=0)*(EE$4:EE$89<>\"\")), EE$4:EE$89),\"zzz\")","v":"zzz"},null,0,{"$f":"IFERROR(LOOKUP(1, 1/((COUNTIF(AQ$70:AQ125, EF$4:EF$89)=0)*(EF$4:EF$89<>\"\")), EF$4:EF$89),\"zzz\")","v":"zzz"},null,0,null,null,0,null,null,0,null,null,0,null,null,0,null,null,0]
[null,null,null,null,null,null,null,null,null,null,null,null,null,null,null,null,null,null,null,null,null,null,null,null,null,null,57,null,null,null,{"$f":"IFERROR(LOOKUP(1, 1/((COUNTIF(AE$70:AE126, EB$4:EB$89)=0)*(EB$4:EB$89<>\"\")), EB$4:EB$89),\"zzz\")","v":"zzz"},null,0,{"$f":"IFERROR(LOOKUP(1, 1/((COUNTIF(AH$70:AH126, EC$4:EC$89)=0)*(EC$4:EC$89<>\"\")), EC$4:EC$89),\"zzz\")","v":"zzz"},null,0,{"$f":"IFERROR(LOOKUP(1, 1/((COUNTIF(AK$70:AK126, ED$4:ED$89)=0)*(ED$4:ED$89<>\"\")), ED$4:ED$89),\"zzz\")","v":"zzz"},null,0,{"$f":"IFERROR(LOOKUP(1, 1/((COUNTIF(AN$70:AN126, EE$4:EE$89)=0)*(EE$4:EE$89<>\"\")), EE$4:EE$89),\"zzz\")","v":"zzz"},null,0,{"$f":"IFERROR(LOOKUP(1, 1/((COUNTIF(AQ$70:AQ126, EF$4:EF$89)=0)*(EF$4:EF$89<>\"\")), EF$4:EF$89),\"zzz\")","v":"zzz"},null,0,null,null,0,null,null,0,null,null,0,null,null,0,null,null,0]
[null,null,null,null,null,null,null,null,null,null,null,null,null,null,null,null,null,null,null,null,null,null,null,null,null,null,58,null,null,null,{"$f":"IFERROR(LOOKUP(1, 1/((COUNTIF(AE$70:AE127, EB$4:EB$89)=0)*(EB$4:EB$89<>\"\")), EB$4:EB$89),\"zzz\")","v":"zzz"},null,0,{"$f":"IFERROR(LOOKUP(1, 1/((COUNTIF(AH$70:AH127, EC$4:EC$89)=0)*(EC$4:EC$89<>\"\")), EC$4:EC$89),\"zzz\")","v":"zzz"},null,0,{"$f":"IFERROR(LOOKUP(1, 1/((COUNTIF(AK$70:AK127, ED$4:ED$89)=0)*(ED$4:ED$89<>\"\")), ED$4:ED$89),\"zzz\")","v":"zzz"},null,0,{"$f":"IFERROR(LOOKUP(1, 1/((COUNTIF(AN$70:AN127, EE$4:EE$89)=0)*(EE$4:EE$89<>\"\")), EE$4:EE$89),\"zzz\")","v":"zzz"},null,0,{"$f":"IFERROR(LOOKUP(1, 1/((COUNTIF(AQ$70:AQ127, EF$4:EF$89)=0)*(EF$4:EF$89<>\"\")), EF$4:EF$89),\"zzz\")","v":"zzz"},null,0,null,null,0,null,null,0,null,null,0,null,null,0,null,null,0]
[null,null,null,null,null,null,null,null,null,null,null,null,null,null,null,null,null,null,null,null,null,null,null,null,null,null,59,null,null,null,{"$f":"IFERROR(LOOKUP(1, 1/((COUNTIF(AE$70:AE128, EB$4:EB$89)=0)*(EB$4:EB$89<>\"\")), EB$4:EB$89),\"zzz\")","v":"zzz"},null,0,{"$f":"IFERROR(LOOKUP(1, 1/((COUNTIF(AH$70:AH128, EC$4:EC$89)=0)*(EC$4:EC$89<>\"\")), EC$4:EC$89),\"zzz\")","v":"zzz"},null,0,{"$f":"IFERROR(LOOKUP(1, 1/((COUNTIF(AK$70:AK128, ED$4:ED$89)=0)*(ED$4:ED$89<>\"\")), ED$4:ED$89),\"zzz\")","v":"zzz"},null,0,{"$f":"IFERROR(LOOKUP(1, 1/((COUNTIF(AN$70:AN128, EE$4:EE$89)=0)*(EE$4:EE$89<>\"\")), EE$4:EE$89),\"zzz\")","v":"zzz"},null,0,{"$f":"IFERROR(LOOKUP(1, 1/((COUNTIF(AQ$70:AQ128, EF$4:EF$89)=0)*(EF$4:EF$89<>\"\")), EF$4:EF$89),\"zzz\")","v":"zzz"},null,0,null,null,0,null,null,0,null,null,0,null,null,0,null,null,0]
[null,null,null,null,null,null,null,null,null,null,null,null,null,null,null,null,null,null,null,null,null,null,null,null,null,null,60,null,null,null,{"$f":"IFERROR(LOOKUP(1, 1/((COUNTIF(AE$70:AE129, EB$4:EB$89)=0)*(EB$4:EB$89<>\"\")), EB$4:EB$89),\"zzz\")","v":"zzz"},null,0,{"$f":"IFERROR(LOOKUP(1, 1/((COUNTIF(AH$70:AH129, EC$4:EC$89)=0)*(EC$4:EC$89<>\"\")), EC$4:EC$89),\"zzz\")","v":"zzz"},null,0,{"$f":"IFERROR(LOOKUP(1, 1/((COUNTIF(AK$70:AK129, ED$4:ED$89)=0)*(ED$4:ED$89<>\"\")), ED$4:ED$89),\"zzz\")","v":"zzz"},null,0,{"$f":"IFERROR(LOOKUP(1, 1/((COUNTIF(AN$70:AN129, EE$4:EE$89)=0)*(EE$4:EE$89<>\"\")), EE$4:EE$89),\"zzz\")","v":"zzz"},null,0,{"$f":"IFERROR(LOOKUP(1, 1/((COUNTIF(AQ$70:AQ129, EF$4:EF$89)=0)*(EF$4:EF$89<>\"\")), EF$4:EF$89),\"zzz\")","v":"zzz"},null,0,null,null,0,null,null,0,null,null,0,null,null,0,null,null,0]
[null,null,null,null,null,null,null,null,null,null,null,null,null,null,null,null,null,null,null,null,null,null,null,null,null,null,61,null,null,null,{"$f":"IFERROR(LOOKUP(1, 1/((COUNTIF(AE$70:AE130, EB$4:EB$89)=0)*(EB$4:EB$89<>\"\")), EB$4:EB$89),\"zzz\")","v":"zzz"},null,0,{"$f":"IFERROR(LOOKUP(1, 1/((COUNTIF(AH$70:AH130, EC$4:EC$89)=0)*(EC$4:EC$89<>\"\")), EC$4:EC$89),\"zzz\")","v":"zzz"},null,0,{"$f":"IFERROR(LOOKUP(1, 1/((COUNTIF(AK$70:AK130, ED$4:ED$89)=0)*(ED$4:ED$89<>\"\")), ED$4:ED$89),\"zzz\")","v":"zzz"},null,0,{"$f":"IFERROR(LOOKUP(1, 1/((COUNTIF(AN$70:AN130, EE$4:EE$89)=0)*(EE$4:EE$89<>\"\")), EE$4:EE$89),\"zzz\")","v":"zzz"},null,0,{"$f":"IFERROR(LOOKUP(1, 1/((COUNTIF(AQ$70:AQ130, EF$4:EF$89)=0)*(EF$4:EF$89<>\"\")), EF$4:EF$89),\"zzz\")","v":"zzz"},null,0,null,null,0,null,null,0,null,null,0,null,null,0,null,null,0]
[null,null,null,null,null,null,null,null,null,null,null,null,null,null,null,null,null,null,null,null,null,null,null,null,null,null,62,null,null,null,{"$f":"IFERROR(LOOKUP(1, 1/((COUNTIF(AE$70:AE131, EB$4:EB$89)=0)*(EB$4:EB$89<>\"\")), EB$4:EB$89),\"zzz\")","v":"zzz"},null,0,{"$f":"IFERROR(LOOKUP(1, 1/((COUNTIF(AH$70:AH131, EC$4:EC$89)=0)*(EC$4:EC$89<>\"\")), EC$4:EC$89),\"zzz\")","v":"zzz"},null,0,{"$f":"IFERROR(LOOKUP(1, 1/((COUNTIF(AK$70:AK131, ED$4:ED$89)=0)*(ED$4:ED$89<>\"\")), ED$4:ED$89),\"zzz\")","v":"zzz"},null,0,{"$f":"IFERROR(LOOKUP(1, 1/((COUNTIF(AN$70:AN131, EE$4:EE$89)=0)*(EE$4:EE$89<>\"\")), EE$4:EE$89),\"zzz\")","v":"zzz"},null,0,{"$f":"IFERROR(LOOKUP(1, 1/((COUNTIF(AQ$70:AQ131, EF$4:EF$89)=0)*(EF$4:EF$89<>\"\")), EF$4:EF$89),\"zzz\")","v":"zzz"},null,0,null,null,0,null,null,0,null,null,0,null,null,0,null,null,0]
[null,null,null,null,null,null,null,null,null,null,null,null,null,null,null,null,null,null,null,null,null,null,null,null,null,null,63,null,null,null,{"$f":"IFERROR(LOOKUP(1, 1/((COUNTIF(AE$70:AE132, EB$4:EB$89)=0)*(EB$4:EB$89<>\"\")), EB$4:EB$89),\"zzz\")","v":"zzz"},null,0,{"$f":"IFERROR(LOOKUP(1, 1/((COUNTIF(AH$70:AH132, EC$4:EC$89)=0)*(EC$4:EC$89<>\"\")), EC$4:EC$89),\"zzz\")","v":"zzz"},null,0,{"$f":"IFERROR(LOOKUP(1, 1/((COUNTIF(AK$70:AK132, ED$4:ED$89)=0)*(ED$4:ED$89<>\"\")), ED$4:ED$89),\"zzz\")","v":"zzz"},null,0,{"$f":"IFERROR(LOOKUP(1, 1/((COUNTIF(AN$70:AN132, EE$4:EE$89)=0)*(EE$4:EE$89<>\"\")), EE$4:EE$89),\"zzz\")","v":"zzz"},null,0,{"$f":"IFERROR(LOOKUP(1, 1/((COUNTIF(AQ$70:AQ132, EF$4:EF$89)=0)*(EF$4:EF$89<>\"\")), EF$4:EF$89),\"zzz\")","v":"zzz"},null,0,null,null,0,null,null,0,null,null,0,null,null,0,null,null,0]
[null,null,null,null,null,null,null,null,null,null,null,null,null,null,null,null,null,null,null,null,null,null,null,null,null,null,64,null,null,null,{"$f":"IFERROR(LOOKUP(1, 1/((COUNTIF(AE$70:AE133, EB$4:EB$89)=0)*(EB$4:EB$89<>\"\")), EB$4:EB$89),\"zzz\")","v":"zzz"},null,0,{"$f":"IFERROR(LOOKUP(1, 1/((COUNTIF(AH$70:AH133, EC$4:EC$89)=0)*(EC$4:EC$89<>\"\")), EC$4:EC$89),\"zzz\")","v":"zzz"},null,0,{"$f":"IFERROR(LOOKUP(1, 1/((COUNTIF(AK$70:AK133, ED$4:ED$89)=0)*(ED$4:ED$89<>\"\")), ED$4:ED$89),\"zzz\")","v":"zzz"},null,0,{"$f":"IFERROR(LOOKUP(1, 1/((COUNTIF(AN$70:AN133, EE$4:EE$89)=0)*(EE$4:EE$89<>\"\")), EE$4:EE$89),\"zzz\")","v":"zzz"},null,0,{"$f":"IFERROR(LOOKUP(1, 1/((COUNTIF(AQ$70:AQ133, EF$4:EF$89)=0)*(EF$4:EF$89<>\"\")), EF$4:EF$89),\"zzz\")","v":"zzz"},null,0,null,null,0,null,null,0,null,null,0,null,null,0,null,null,0]
[null,null,null,null,null,null,null,null,null,null,null,null,null,null,null,null,null,null,null,null,null,null,null,null,null,null,65,null,null,null,{"$f":"IFERROR(LOOKUP(1, 1/((COUNTIF(AE$70:AE134, EB$4:EB$89)=0)*(EB$4:EB$89<>\"\")), EB$4:EB$89),\"zzz\")","v":"zzz"},null,0,{"$f":"IFERROR(LOOKUP(1, 1/((COUNTIF(AH$70:AH134, EC$4:EC$89)=0)*(EC$4:EC$89<>\"\")), EC$4:EC$89),\"zzz\")","v":"zzz"},null,{"$f":"COUNTIF($AE$16:$DZ$27,AI135)","v":0},{"$f":"IFERROR(LOOKUP(1, 1/((COUNTIF(AK$70:AK134, ED$4:ED$89)=0)*(ED$4:ED$89<>\"\")), ED$4:ED$89),\"zzz\")","v":"zzz"},null,0,{"$f":"IFERROR(LOOKUP(1, 1/((COUNTIF(AN$70:AN134, EE$4:EE$89)=0)*(EE$4:EE$89<>\"\")), EE$4:EE$89),\"zzz\")","v":"zzz"},null,0,{"$f":"IFERROR(LOOKUP(1, 1/((COUNTIF(AQ$70:AQ134, EF$4:EF$89)=0)*(EF$4:EF$89<>\"\")), EF$4:EF$89),\"zzz\")","v":"zzz"},null,0,null,null,0,null,null,0,null,null,0,null,null,0,null,null,0]
[null,null,null,null,null,null,null,null,null,null,null,null,null,null,null,null,null,null,null,null,null,null,null,null,null,null,66,null,null,null,{"$f":"IFERROR(LOOKUP(1, 1/((COUNTIF(AE$70:AE135, EB$4:EB$89)=0)*(EB$4:EB$89<>\"\")), EB$4:EB$89),\"zzz\")","v":"zzz"},null,{"$f":"COUNTIF($AE$4:$DZ$15,AF136)","v":0},{"$f":"IFERROR(LOOKUP(1, 1/((COUNTIF(AH$70:AH135, EC$4:EC$89)=0)*(EC$4:EC$89<>\"\")), EC$4:EC$89),\"zzz\")","v":"zzz"},null,0,{"$f":"IFERROR(LOOKUP(1, 1/((COUNTIF(AK$70:AK135, ED$4:ED$89)=0)*(ED$4:ED$89<>\"\")), ED$4:ED$89),\"zzz\")","v":"zzz"},null,{"$f":"COUNTIF($AE$28:$DZ$39,AL136)","v":0},{"$f":"IFERROR(LOOKUP(1, 1/((COUNTIF(AN$70:AN135, EE$4:EE$89)=0)*(EE$4:EE$89<>\"\")), EE$4:EE$89),\"zzz\")","v":"zzz"},null,{"$f":"COUNTIF($AE$40:$DZ$51,AO136)","v":0},{"$f":"IFERROR(LOOKUP(1, 1/((COUNTIF(AQ$70:AQ135, EF$4:EF$89)=0)*(EF$4:EF$89<>\"\")), EF$4:EF$89),\"zzz\")","v":"zzz"},null,{"$f":"COUNTIF($AE$52:$DZ$63,AR136)","v":0},null,null,0,null,null,0,null,null,0,null,null,0,null,null,0]
[null,null,null,null,null,null,null,null,null,null,null,null,null,null,null,null,null,null,null,null,null,null,null,null,null,null,67,null,null,null,{"$f":"IFERROR(LOOKUP(1, 1/((COUNTIF(AE$70:AE136, EB$4:EB$89)=0)*(EB$4:EB$89<>\"\")), EB$4:EB$89),\"zzz\")","v":"zzz"},null,0,{"$f":"IFERROR(LOOKUP(1, 1/((COUNTIF(AH$70:AH136, EC$4:EC$89)=0)*(EC$4:EC$89<>\"\")), EC$4:EC$89),\"zzz\")","v":"zzz"},null,0,{"$f":"IFERROR(LOOKUP(1, 1/((COUNTIF(AK$70:AK136, ED$4:ED$89)=0)*(ED$4:ED$89<>\"\")), ED$4:ED$89),\"zzz\")","v":"zzz"},null,0,{"$f":"IFERROR(LOOKUP(1, 1/((COUNTIF(AN$70:AN136, EE$4:EE$89)=0)*(EE$4:EE$89<>\"\")), EE$4:EE$89),\"zzz\")","v":"zzz"},null,0,{"$f":"IFERROR(LOOKUP(1, 1/((COUNTIF(AQ$70:AQ136, EF$4:EF$89)=0)*(EF$4:EF$89<>\"\")), EF$4:EF$89),\"zzz\")","v":"zzz"},null,0,null,null,0,null,null,0,null,null,0,null,null,0,null,null,0]
[null,null,null,null,null,null,null,null,null,null,null,null,null,null,null,null,null,null,null,null,null,null,null,null,null,null,68,null,null,null,{"$f":"IFERROR(LOOKUP(1, 1/((COUNTIF(AE$70:AE137, EB$4:EB$89)=0)*(EB$4:EB$89<>\"\")), EB$4:EB$89),\"zzz\")","v":"zzz"},null,0,{"$f":"IFERROR(LOOKUP(1, 1/((COUNTIF(AH$70:AH137, EC$4:EC$89)=0)*(EC$4:EC$89<>\"\")), EC$4:EC$89),\"zzz\")","v":"zzz"},null,0,{"$f":"IFERROR(LOOKUP(1, 1/((COUNTIF(AK$70:AK137, ED$4:ED$89)=0)*(ED$4:ED$89<>\"\")), ED$4:ED$89),\"zzz\")","v":"zzz"},null,0,{"$f":"IFERROR(LOOKUP(1, 1/((COUNTIF(AN$70:AN137, EE$4:EE$89)=0)*(EE$4:EE$89<>\"\")), EE$4:EE$89),\"zzz\")","v":"zzz"},null,0,{"$f":"IFERROR(LOOKUP(1, 1/((COUNTIF(AQ$70:AQ137, EF$4:EF$89)=0)*(EF$4:EF$89<>\"\")), EF$4:EF$89),\"zzz\")","v":"zzz"},null,0,null,null,0,null,null,0,null,null,0,null,null,0,null,null,0]
[null,null,null,null,null,null,null,null,null,null,null,null,null,null,null,null,null,null,null,null,null,null,null,null,null,null,69,null,null,null,{"$f":"IFERROR(LOOKUP(1, 1/((COUNTIF(AE$70:AE138, EB$4:EB$89)=0)*(EB$4:EB$89<>\"\")), EB$4:EB$89),\"zzz\")","v":"zzz"},null,0,{"$f":"IFERROR(LOOKUP(1, 1/((COUNTIF(AH$70:AH138, EC$4:EC$89)=0)*(EC$4:EC$89<>\"\")), EC$4:EC$89),\"zzz\")","v":"zzz"},null,0,{"$f":"IFERROR(LOOKUP(1, 1/((COUNTIF(AK$70:AK138, ED$4:ED$89)=0)*(ED$4:ED$89<>\"\")), ED$4:ED$89),\"zzz\")","v":"zzz"},null,0,{"$f":"IFERROR(LOOKUP(1, 1/((COUNTIF(AN$70:AN138, EE$4:EE$89)=0)*(EE$4:EE$89<>\"\")), EE$4:EE$89),\"zzz\")","v":"zzz"},null,0,{"$f":"IFERROR(LOOKUP(1, 1/((COUNTIF(AQ$70:AQ138, EF$4:EF$89)=0)*(EF$4:EF$89<>\"\")), EF$4:EF$89),\"zzz\")","v":"zzz"},null,0,null,null,0,null,null,0,null,null,0,null,null,0,null,null,0]
[null,null,null,null,null,null,null,null,null,null,null,null,null,null,null,null,null,null,null,null,null,null,null,null,null,null,70,null,null,null,{"$f":"IFERROR(LOOKUP(1, 1/((COUNTIF(AE$70:AE139, EB$4:EB$89)=0)*(EB$4:EB$89<>\"\")), EB$4:EB$89),\"zzz\")","v":"zzz"},null,0,{"$f":"IFERROR(LOOKUP(1, 1/((COUNTIF(AH$70:AH139, EC$4:EC$89)=0)*(EC$4:EC$89<>\"\")), EC$4:EC$89),\"zzz\")","v":"zzz"},null,0,{"$f":"IFERROR(LOOKUP(1, 1/((COUNTIF(AK$70:AK139, ED$4:ED$89)=0)*(ED$4:ED$89<>\"\")), ED$4:ED$89),\"zzz\")","v":"zzz"},null,0,{"$f":"IFERROR(LOOKUP(1, 1/((COUNTIF(AN$70:AN139, EE$4:EE$89)=0)*(EE$4:EE$89<>\"\")), EE$4:EE$89),\"zzz\")","v":"zzz"},null,0,{"$f":"IFERROR(LOOKUP(1, 1/((COUNTIF(AQ$70:AQ139, EF$4:EF$89)=0)*(EF$4:EF$89<>\"\")), EF$4:EF$89),\"zzz\")","v":"zzz"},null,0,null,null,0,null,null,0,null,null,0,null,null,0,null,null,0]
[null,null,null,null,null,null,null,null,null,null,null,null,null,null,null,null,null,null,null,null,null,null,null,null,null,null,71,null,null,null,{"$f":"IFERROR(LOOKUP(1, 1/((COUNTIF(AE$70:AE140, EB$4:EB$89)=0)*(EB$4:EB$89<>\"\")), EB$4:EB$89),\"zzz\")","v":"zzz"},null,0,{"$f":"IFERROR(LOOKUP(1, 1/((COUNTIF(AH$70:AH140, EC$4:EC$89)=0)*(EC$4:EC$89<>\"\")), EC$4:EC$89),\"zzz\")","v":"zzz"},null,0,{"$f":"IFERROR(LOOKUP(1, 1/((COUNTIF(AK$70:AK140, ED$4:ED$89)=0)*(ED$4:ED$89<>\"\")), ED$4:ED$89),\"zzz\")","v":"zzz"},null,0,{"$f":"IFERROR(LOOKUP(1, 1/((COUNTIF(AN$70:AN140, EE$4:EE$89)=0)*(EE$4:EE$89<>\"\")), EE$4:EE$89),\"zzz\")","v":"zzz"},null,0,{"$f":"IFERROR(LOOKUP(1, 1/((COUNTIF(AQ$70:AQ140, EF$4:EF$89)=0)*(EF$4:EF$89<>\"\")), EF$4:EF$89),\"zzz\")","v":"zzz"},null,0,null,null,0,null,null,0,null,null,0,null,null,0,null,null,0]
[null,null,null,null,null,null,null,null,null,null,null,null,null,null,null,null,null,null,null,null,null,null,null,null,null,null,72,null,null,null,{"$f":"IFERROR(LOOKUP(1, 1/((COUNTIF(AE$70:AE141, EB$4:EB$89)=0)*(EB$4:EB$89<>\"\")), EB$4:EB$89),\"zzz\")","v":"zzz"},null,0,{"$f":"IFERROR(LOOKUP(1, 1/((COUNTIF(AH$70:AH141, EC$4:EC$89)=0)*(EC$4:EC$89<>\"\")), EC$4:EC$89),\"zzz\")","v":"zzz"},null,0,{"$f":"IFERROR(LOOKUP(1, 1/((COUNTIF(AK$70:AK141, ED$4:ED$89)=0)*(ED$4:ED$89<>\"\")), ED$4:ED$89),\"zzz\")","v":"zzz"},null,0,{"$f":"IFERROR(LOOKUP(1, 1/((COUNTIF(AN$70:AN141, EE$4:EE$89)=0)*(EE$4:EE$89<>\"\")), EE$4:EE$89),\"zzz\")","v":"zzz"},null,0,{"$f":"IFERROR(LOOKUP(1, 1/((COUNTIF(AQ$70:AQ141, EF$4:EF$89)=0)*(EF$4:EF$89<>\"\")), EF$4:EF$89),\"zzz\")","v":"zzz"},null,0,null,null,0,null,null,0,null,null,0,null,null,0,null,null,0]
[null,null,null,null,null,null,null,null,null,null,null,null,null,null,null,null,null,null,null,null,null,null,null,null,null,null,73,null,null,null,{"$f":"IFERROR(LOOKUP(1, 1/((COUNTIF(AE$70:AE142, EB$4:EB$89)=0)*(EB$4:EB$89<>\"\")), EB$4:EB$89),\"zzz\")","v":"zzz"},null,0,{"$f":"IFERROR(LOOKUP(1, 1/((COUNTIF(AH$70:AH142, EC$4:EC$89)=0)*(EC$4:EC$89<>\"\")), EC$4:EC$89),\"zzz\")","v":"zzz"},null,0,{"$f":"IFERROR(LOOKUP(1, 1/((COUNTIF(AK$70:AK142, ED$4:ED$89)=0)*(ED$4:ED$89<>\"\")), ED$4:ED$89),\"zzz\")","v":"zzz"},null,0,{"$f":"IFERROR(LOOKUP(1, 1/((COUNTIF(AN$70:AN142, EE$4:EE$89)=0)*(EE$4:EE$89<>\"\")), EE$4:EE$89),\"zzz\")","v":"zzz"},null,0,{"$f":"IFERROR(LOOKUP(1, 1/((COUNTIF(AQ$70:AQ142, EF$4:EF$89)=0)*(EF$4:EF$89<>\"\")), EF$4:EF$89),\"zzz\")","v":"zzz"},null,0,null,null,0,null,null,0,null,null,0,null,null,0,null,null,0]
[null,null,null,null,null,null,null,null,null,null,null,null,null,null,null,null,null,null,null,null,null,null,null,null,null,null,74,null,null,null,{"$f":"IFERROR(LOOKUP(1, 1/((COUNTIF(AE$70:AE143, EB$4:EB$89)=0)*(EB$4:EB$89<>\"\")), EB$4:EB$89),\"zzz\")","v":"zzz"},null,0,{"$f":"IFERROR(LOOKUP(1, 1/((COUNTIF(AH$70:AH143, EC$4:EC$89)=0)*(EC$4:EC$89<>\"\")), EC$4:EC$89),\"zzz\")","v":"zzz"},null,0,{"$f":"IFERROR(LOOKUP(1, 1/((COUNTIF(AK$70:AK143, ED$4:ED$89)=0)*(ED$4:ED$89<>\"\")), ED$4:ED$89),\"zzz\")","v":"zzz"},null,0,{"$f":"IFERROR(LOOKUP(1, 1/((COUNTIF(AN$70:AN143, EE$4:EE$89)=0)*(EE$4:EE$89<>\"\")), EE$4:EE$89),\"zzz\")","v":"zzz"},null,0,{"$f":"IFERROR(LOOKUP(1, 1/((COUNTIF(AQ$70:AQ143, EF$4:EF$89)=0)*(EF$4:EF$89<>\"\")), EF$4:EF$89),\"zzz\")","v":"zzz"},null,0,null,null,0,null,null,0,null,null,0,null,null,0,null,null,0]
[null,null,null,null,null,null,null,null,null,null,null,null,null,null,null,null,null,null,null,null,null,null,null,null,null,null,75,null,null,null,{"$f":"IFERROR(LOOKUP(1, 1/((COUNTIF(AE$70:AE144, EB$4:EB$89)=0)*(EB$4:EB$89<>\"\")), EB$4:EB$89),\"zzz\")","v":"zzz"},null,0,{"$f":"IFERROR(LOOKUP(1, 1/((COUNTIF(AH$70:AH144, EC$4:EC$89)=0)*(EC$4:EC$89<>\"\")), EC$4:EC$89),\"zzz\")","v":"zzz"},null,0,{"$f":"IFERROR(LOOKUP(1, 1/((COUNTIF(AK$70:AK144, ED$4:ED$89)=0)*(ED$4:ED$89<>\"\")), ED$4:ED$89),\"zzz\")","v":"zzz"},null,0,{"$f":"IFERROR(LOOKUP(1, 1/((COUNTIF(AN$70:AN144, EE$4:EE$89)=0)*(EE$4:EE$89<>\"\")), EE$4:EE$89),\"zzz\")","v":"zzz"},null,0,{"$f":"IFERROR(LOOKUP(1, 1/((COUNTIF(AQ$70:AQ144, EF$4:EF$89)=0)*(EF$4:EF$89<>\"\")), EF$4:EF$89),\"zzz\")","v":"zzz"},null,0,null,null,0,null,null,0,null,null,0,null,null,0,null,null,0]
[null,null,null,null,null,null,null,null,null,null,null,null,null,null,null,null,null,null,null,null,null,null,null,null,null,null,76,null,null,null,{"$f":"IFERROR(LOOKUP(1, 1/((COUNTIF(AE$70:AE145, EB$4:EB$89)=0)*(EB$4:EB$89<>\"\")), EB$4:EB$89),\"zzz\")","v":"zzz"},null,0,{"$f":"IFERROR(LOOKUP(1, 1/((COUNTIF(AH$70:AH145, EC$4:EC$89)=0)*(EC$4:EC$89<>\"\")), EC$4:EC$89),\"zzz\")","v":"zzz"},null,0,{"$f":"IFERROR(LOOKUP(1, 1/((COUNTIF(AK$70:AK145, ED$4:ED$89)=0)*(ED$4:ED$89<>\"\")), ED$4:ED$89),\"zzz\")","v":"zzz"},null,0,{"$f":"IFERROR(LOOKUP(1, 1/((COUNTIF(AN$70:AN145, EE$4:EE$89)=0)*(EE$4:EE$89<>\"\")), EE$4:EE$89),\"zzz\")","v":"zzz"},null,0,{"$f":"IFERROR(LOOKUP(1, 1/((COUNTIF(AQ$70:AQ145, EF$4:EF$89)=0)*(EF$4:EF$89<>\"\")), EF$4:EF$89),\"zzz\")","v":"zzz"},null,0,null,null,0,null,null,0,null,null,0,null,null,0,null,null,0]
[null,null,null,null,null,null,null,null,null,null,null,null,null,null,null,null,null,null,null,null,null,null,null,null,null,null,77,null,null,null,{"$f":"IFERROR(LOOKUP(1, 1/((COUNTIF(AE$70:AE146, EB$4:EB$89)=0)*(EB$4:EB$89<>\"\")), EB$4:EB$89),\"zzz\")","v":"zzz"},null,0,{"$f":"IFERROR(LOOKUP(1, 1/((COUNTIF(AH$70:AH146, EC$4:EC$89)=0)*(EC$4:EC$89<>\"\")), EC$4:EC$89),\"zzz\")","v":"zzz"},null,0,{"$f":"IFERROR(LOOKUP(1, 1/((COUNTIF(AK$70:AK146, ED$4:ED$89)=0)*(ED$4:ED$89<>\"\")), ED$4:ED$89),\"zzz\")","v":"zzz"},null,0,{"$f":"IFERROR(LOOKUP(1, 1/((COUNTIF(AN$70:AN146, EE$4:EE$89)=0)*(EE$4:EE$89<>\"\")), EE$4:EE$89),\"zzz\")","v":"zzz"},null,0,{"$f":"IFERROR(LOOKUP(1, 1/((COUNTIF(AQ$70:AQ146, EF$4:EF$89)=0)*(EF$4:EF$89<>\"\")), EF$4:EF$89),\"zzz\")","v":"zzz"},null,0]
[null,null,null,null,null,null,null,null,null,null,null,null,null,null,null,null,null,null,null,null,null,null,null,null,null,null,78,null,null,null,{"$f":"IFERROR(LOOKUP(1, 1/((COUNTIF(AE$70:AE147, EB$4:EB$89)=0)*(EB$4:EB$89<>\"\")), EB$4:EB$89),\"zzz\")","v":"zzz"},null,0,{"$f":"IFERROR(LOOKUP(1, 1/((COUNTIF(AH$70:AH147, EC$4:EC$89)=0)*(EC$4:EC$89<>\"\")), EC$4:EC$89),\"zzz\")","v":"zzz"},null,0,{"$f":"IFERROR(LOOKUP(1, 1/((COUNTIF(AK$70:AK147, ED$4:ED$89)=0)*(ED$4:ED$89<>\"\")), ED$4:ED$89),\"zzz\")","v":"zzz"},null,0,{"$f":"IFERROR(LOOKUP(1, 1/((COUNTIF(AN$70:AN147, EE$4:EE$89)=0)*(EE$4:EE$89<>\"\")), EE$4:EE$89),\"zzz\")","v":"zzz"},null,0,{"$f":"IFERROR(LOOKUP(1, 1/((COUNTIF(AQ$70:AQ147, EF$4:EF$89)=0)*(EF$4:EF$89<>\"\")), EF$4:EF$89),\"zzz\")","v":"zzz"},null,0]
[null,null,null,null,null,null,null,null,null,null,null,null,null,null,null,null,null,null,null,null,null,null,null,null,null,null,79,null,null,null,{"$f":"IFERROR(LOOKUP(1, 1/((COUNTIF(AE$70:AE148, EB$4:EB$89)=0)*(EB$4:EB$89<>\"\")), EB$4:EB$89),\"zzz\")","v":"zzz"},null,0,{"$f":"IFERROR(LOOKUP(1, 1/((COUNTIF(AH$70:AH148, EC$4:EC$89)=0)*(EC$4:EC$89<>\"\")), EC$4:EC$89),\"zzz\")","v":"zzz"},null,0,{"$f":"IFERROR(LOOKUP(1, 1/((COUNTIF(AK$70:AK148, ED$4:ED$89)=0)*(ED$4:ED$89<>\"\")), ED$4:ED$89),\"zzz\")","v":"zzz"},null,0,{"$f":"IFERROR(LOOKUP(1, 1/((COUNTIF(AN$70:AN148, EE$4:EE$89)=0)*(EE$4:EE$89<>\"\")), EE$4:EE$89),\"zzz\")","v":"zzz"},null,0,{"$f":"IFERROR(LOOKUP(1, 1/((COUNTIF(AQ$70:AQ148, EF$4:EF$89)=0)*(EF$4:EF$89<>\"\")), EF$4:EF$89),\"zzz\")","v":"zzz"},null,0]
[null,null,null,null,null,null,null,null,null,null,null,null,null,null,null,null,null,null,null,null,null,null,null,null,null,null,80,null,null,null,{"$f":"IFERROR(LOOKUP(1, 1/((COUNTIF(AE$70:AE149, EB$4:EB$89)=0)*(EB$4:EB$89<>\"\")), EB$4:EB$89),\"zzz\")","v":"zzz"},null,0,{"$f":"IFERROR(LOOKUP(1, 1/((COUNTIF(AH$70:AH149, EC$4:EC$89)=0)*(EC$4:EC$89<>\"\")), EC$4:EC$89),\"zzz\")","v":"zzz"},null,0,{"$f":"IFERROR(LOOKUP(1, 1/((COUNTIF(AK$70:AK149, ED$4:ED$89)=0)*(ED$4:ED$89<>\"\")), ED$4:ED$89),\"zzz\")","v":"zzz"},null,0,{"$f":"IFERROR(LOOKUP(1, 1/((COUNTIF(AN$70:AN149, EE$4:EE$89)=0)*(EE$4:EE$89<>\"\")), EE$4:EE$89),\"zzz\")","v":"zzz"},null,0,{"$f":"IFERROR(LOOKUP(1, 1/((COUNTIF(AQ$70:AQ149, EF$4:EF$89)=0)*(EF$4:EF$89<>\"\")), EF$4:EF$89),\"zzz\")","v":"zzz"},null,0]

{"sheet":"results compilation","index":3,"n_rows":465,"n_cols":4,"rows_kept":465,"cut":false,"hidden":true,"merged":[]}
["test sect.","avg","cov","Test 1"]
[{"$f":"'Data entry template'!C7","v":1.1000000000000001}]
[{"$f":"'Data entry template'!C8","v":1.2}]
[{"$f":"'Data entry template'!C9","v":1.3}]
[{"$f":"'Data entry template'!C10","v":1.4}]
[{"$f":"'Data entry template'!C11","v":1.5}]
[{"$f":"'Data entry template'!C12","v":1.6}]
[{"$f":"'Data entry template'!C13","v":1.7}]
[]
[]
[{"$f":"A13&\"b\"","v":"2.1b"},{"$f":"IF(ISBLANK(A11),\"\",IF(COUNTBLANK(D11:CY11)=100,\"N/A\",IFERROR(AVERAGE(D11:CY11),\"\")))","v":"N/A"},{"$f":"IF(B11=0,0,IF(B11=\"N/A\",\"N/A\",IF(B11=\"\",\"\",IF(_xlfn.STDEV.P(D11:CY11)=0,0,IFERROR(_xlfn.CONFIDENCE.T('background calcs'!$Q$4,_xlfn.STDEV.S(D11:CY11),COUNT(D11:CY11)),\"N/A\")))))","v":"N/A"}]
[{"$f":"A13&\"c\"","v":"2.1c"},{"$f":"IF(ISBLANK(A12),\"\",IF(COUNTBLANK(D12:CY12)=100,\"N/A\",IFERROR(AVERAGE(D12:CY12),\"\")))","v":"N/A"},{"$f":"IF(B12=0,0,IF(B12=\"N/A\",\"N/A\",IF(B12=\"\",\"\",IF(_xlfn.STDEV.P(D12:CY12)=0,0,IFERROR(_xlfn.CONFIDENCE.T('background calcs'!$Q$4,_xlfn.STDEV.S(D12:CY12),COUNT(D12:CY12)),\"N/A\")))))","v":"N/A"}]
[{"$f":"'Data entry template'!C15","v":2.1},{"$f":"IF(COUNTBLANK(D11:CY12)=200,\"N/A\",2*(2-SUM(B11:B12)))","v":"N/A"},{"$f":"IFERROR(AVERAGE(C11:C12),\"N/A\")","v":"N/A"}]
[null,{"$f":"IF(ISBLANK(A14),\"\",IF(COUNTBLANK(D14:CY14)=100,\"N/A\",IFERROR(AVERAGE(D14:CY14),\"\")))","v":""},{"$f":"IF(B14=0,0,IF(B14=\"N/A\",\"N/A\",IF(B14=\"\",\"\",IF(_xlfn.STDEV.P(D14:CY14)=0,0,IFERROR(_xlfn.CONFIDENCE.T('background calcs'!$Q$4,_xlfn.STDEV.S(D14:CY14),COUNT(D14:CY14)),\"N/A\")))))","v":""}]
[{"$f":"'Data entry template'!C19&\"tsf\"","v":"2.2tsf"},{"$f":"IF(COUNTBLANK(D15:CY15)=100,0,IFERROR(AVERAGE(D15:CY15),\"\"))","v":0},{"$f":"IF(B15=0,0,IF(B15=\"N/A\",\"N/A\",IF(_xlfn.STDEV.P(D15:CY15)=0,0,IFERROR(_xlfn.CONFIDENCE.T('background calcs'!$Q$4,_xlfn.STDEV.S(D15:CY15),COUNT(D15:CY15)),\"N/A\"))))","v":0}]
[null,{"$f":"IF(ISBLANK(A16),\"\",IF(COUNTBLANK(D16:CY16)=100,\"N/A\",IFERROR(AVERAGE(D16:CY16),\"\")))","v":""},{"$f":"IF(B16=0,0,IF(B16=\"N/A\",\"N/A\",IF(B16=\"\",\"\",IF(_xlfn.STDEV.P(D16:CY16)=0,0,IFERROR(_xlfn.CONFIDENCE.T('background calcs'!$Q$4,_xlfn.STDEV.S(D16:CY16),COUNT(D16:CY16)),\"N/A\")))))","v":""},"IF NO:"]
[{"$f":"A21&\"b\"","v":"2.2b"},{"$f":"IF(ISBLANK(A17),\"\",IF(COUNTBLANK(D17:CY17)=100,\"N/A\",IFERROR(AVERAGE(D17:CY17),\"\")))","v":"N/A"},{"$f":"IF(B17=0,0,IF(B17=\"N/A\",\"N/A\",IF(B17=\"\",\"\",IF(_xlfn.STDEV.P(D17:CY17)=0,0,IFERROR(_xlfn.CONFIDENCE.T('background calcs'!$Q$4,_xlfn.STDEV.S(D17:CY17),COUNT(D17:CY17)),\"N/A\")))))","v":"N/A"}]
[{"$f":"A21&\"c\"","v":"2.2c"},{"$f":"IF(ISBLANK(A18),\"\",IF(COUNTBLANK(D18:CY18)=100,\"N/A\",IFERROR(AVERAGE(D18:CY18),\"\")))","v":"N/A"},{"$f":"IF(B18=0,0,IF(B18=\"N/A\",\"N/A\",IF(B18=\"\",\"\",IF(_xlfn.STDEV.P(D18:CY18)=0,0,IFERROR(_xlfn.CONFIDENCE.T('background calcs'!$Q$4,_xlfn.STDEV.S(D18:CY18),COUNT(D18:CY18)),\"N/A\")))))","v":"N/A"}]
[null,{"$f":"IF(ISBLANK(A19),\"\",IF(COUNTBLANK(D19:CY19)=100,\"N/A\",IFERROR(AVERAGE(D19:CY19),\"\")))","v":""},{"$f":"IF(B19=0,0,IF(B19=\"N/A\",\"N/A\",IF(B19=\"\",\"\",IF(_xlfn.STDEV.P(D19:CY19)=0,0,IFERROR(_xlfn.CONFIDENCE.T('background calcs'!$Q$4,_xlfn.STDEV.S(D19:CY19),COUNT(D19:CY19)),\"N/A\")))))","v":""},"OR"]
[{"$f":"A21&\"d\"","v":"2.2d"},{"$f":"IF(COUNTBLANK(D20:CY20)=100,0,IFERROR(AVERAGE(D20:CY20),\"\"))","v":0},{"$f":"IF(B20=0,0,IF(B20=\"N/A\",\"N/A\",IF(_xlfn.STDEV.P(D20:CY20)=0,0,IFERROR(_xlfn.CONFIDENCE.T('background calcs'!$Q$4,_xlfn.STDEV.S(D20:CY20),COUNT(D20:CY20)),\"N/A\"))))","v":0}]
[{"$f":"'Data entry template'!C19","v":2.2000000000000002},{"$f":"IFERROR(IF(B15=1,1,(IFERROR(B17*B18,0)*COUNT(D17:CY17)+IFERROR(B20,0)*COUNT(D20:CY20))/(COUNT(D17:CY17)+COUNT(D20:CY20))),\"N/A\")","v":"N/A"},{"$f":"IF(B21=\"N/A\",\"N/A\",IFERROR(AVERAGE(C17:C18,C20,C15),\"N/A\"))","v":"N/A"}]
[null,{"$f":"IF(ISBLANK(A22),\"\",IF(COUNTBLANK(D22:CY22)=100,\"N/A\",IFERROR(AVERAGE(D22:CY22),\"\")))","v":""},{"$f":"IF(B22=0,0,IF(B22=\"N/A\",\"N/A\",IF(B22=\"\",\"\",IF(_xlfn.STDEV.P(D22:CY22)=0,0,IFERROR(_xlfn.CONFIDENCE.T('background calcs'!$Q$4,_xlfn.STDEV.S(D22:CY22),COUNT(D22:CY22)),\"N/A\")))))","v":""}]
[{"$f":"A25&\"a\"","v":"2.3a"},{"$f":"IF(ISBLANK(A23),\"\",IF(COUNTBLANK(D23:CY23)=100,\"N/A\",IFERROR(AVERAGE(D23:CY23),\"\")))","v":"N/A"},{"$f":"IF(B23=0,0,IF(B23=\"N/A\",\"N/A\",IF(B23=\"\",\"\",IF(_xlfn.STDEV.P(D23:CY23)=0,0,IFERROR(_xlfn.CONFIDENCE.T('background calcs'!$Q$4,_xlfn.STDEV.S(D23:CY23),COUNT(D23:CY23)),\"N/A\")))))","v":"N/A"}]
[{"$f":"A25&\"b\"","v":"2.3b"},"N/A",{"$f":"IF(B24=0,0,IF(B24=\"N/A\",\"N/A\",IF(B24=\"\",\"\",IF(_xlfn.STDEV.P(D24:CY24)=0,0,IFERROR(_xlfn.CONFIDENCE.T('background calcs'!$Q$4,_xlfn.STDEV.S(D24:CY24),COUNT(D24:CY24)),\"N/A\")))))","v":"N/A"}]
[{"$f":"'Data entry template'!C27","v":2.2999999999999998},{"$f":"IF(COUNTBLANK(D23:CY24)=200,\"N/A\",SUM(B23:B24))","v":"N/A"},{"$f":"IFERROR(AVERAGE(C23:C24),\"N/A\")","v":"N/A"}]
[null,{"$f":"IF(ISBLANK(A26),\"\",IF(COUNTBLANK(D26:CY26)=100,\"N/A\",IFERROR(AVERAGE(D26:CY26),\"\")))","v":""},{"$f":"IF(B26=0,0,IF(B26=\"N/A\",\"N/A\",IF(B26=\"\",\"\",IF(_xlfn.STDEV.P(D26:CY26)=0,0,IFERROR(_xlfn.CONFIDENCE.T('background calcs'!$Q$4,_xlfn.STDEV.S(D26:CY26),COUNT(D26:CY26)),\"N/A\")))))","v":""}]
[{"$f":"'Data entry template'!C31","v":2.4},"N/A",{"$f":"IF(B27=0,0,IF(B27=\"N/A\",\"N/A\",IF(B27=\"\",\"\",IF(_xlfn.STDEV.P(D27:CY27)=0,0,IFERROR(_xlfn.CONFIDENCE.T('background calcs'!$Q$4,_xlfn.STDEV.S(D27:CY27),COUNT(D27:CY27)),\"N/A\")))))","v":"N/A"}]
[null,"",{"$f":"IF(B28=0,0,IF(B28=\"N/A\",\"N/A\",IF(B28=\"\",\"\",IF(_xlfn.STDEV.P(D28:CY28)=0,0,IFERROR(_xlfn.CONFIDENCE.T('background calcs'!$Q$4,_xlfn.STDEV.S(D28:CY28),COUNT(D28:CY28)),\"N/A\")))))","v":""}]
[null,"",{"$f":"IF(B29=0,0,IF(B29=\"N/A\",\"N/A\",IF(B29=\"\",\"\",IF(_xlfn.STDEV.P(D29:CY29)=0,0,IFERROR(_xlfn.CONFIDENCE.T('background calcs'!$Q$4,_xlfn.STDEV.S(D29:CY29),COUNT(D29:CY29)),\"N/A\")))))","v":""}]
[null,"",{"$f":"IF(B30=0,0,IF(B30=\"N/A\",\"N/A\",IF(B30=\"\",\"\",IF(_xlfn.STDEV.P(D30:CY30)=0,0,IFERROR(_xlfn.CONFIDENCE.T('background calcs'!$Q$4,_xlfn.STDEV.S(D30:CY30),COUNT(D30:CY30)),\"N/A\")))))","v":""}]
[{"$f":"'Data entry template'!C35","v":3.1},"N/A",{"$f":"IF(B31=0,0,IF(B31=\"N/A\",\"N/A\",IF(B31=\"\",\"\",IF(_xlfn.STDEV.P(D31:CY31)=0,0,IFERROR(_xlfn.CONFIDENCE.T('background calcs'!$Q$4,_xlfn.STDEV.S(D31:CY31),COUNT(D31:CY31)),\"N/A\")))))","v":"N/A"}]
[{"$f":"A31&\"b\"","v":"3.1b"},"N/A",{"$f":"IF(B32=0,0,IF(B32=\"N/A\",\"N/A\",IF(B32=\"\",\"\",IF(_xlfn.STDEV.P(D32:CY32)=0,0,IFERROR(_xlfn.CONFIDENCE.T('background calcs'!$Q$4,_xlfn.STDEV.S(D32:CY32),COUNT(D32:CY32)),\"N/A\")))))","v":"N/A"}]
[{"$f":"A31&\"c\"","v":"3.1c"},"N/A",{"$f":"IF(B33=0,0,IF(B33=\"N/A\",\"N/A\",IF(B33=\"\",\"\",IF(_xlfn.STDEV.P(D33:CY33)=0,0,IFERROR(_xlfn.CONFIDENCE.T('background calcs'!$Q$4,_xlfn.STDEV.S(D33:CY33),COUNT(D33:CY33)),\"N/A\")))))","v":"N/A"}]
[null,"",{"$f":"IF(B34=0,0,IF(B34=\"N/A\",\"N/A\",IF(B34=\"\",\"\",IF(_xlfn.STDEV.P(D34:CY34)=0,0,IFERROR(_xlfn.CONFIDENCE.T('background calcs'!$Q$4,_xlfn.STDEV.S(D34:CY34),COUNT(D34:CY34)),\"N/A\")))))","v":""}]
[null,"",{"$f":"IF(B35=0,0,IF(B35=\"N/A\",\"N/A\",IF(B35=\"\",\"\",IF(_xlfn.STDEV.P(D35:CY35)=0,0,IFERROR(_xlfn.CONFIDENCE.T('background calcs'!$Q$4,_xlfn.STDEV.S(D35:CY35),COUNT(D35:CY35)),\"N/A\")))))","v":""}]
[{"$f":"'Data entry template'!C40","v":3.2},"N/A",{"$f":"IF(B36=0,0,IF(B36=\"N/A\",\"N/A\",IF(B36=\"\",\"\",IF(_xlfn.STDEV.P(D36:CY36)=0,0,IFERROR(_xlfn.CONFIDENCE.T('background calcs'!$Q$4,_xlfn.STDEV.S(D36:CY36),COUNT(D36:CY36)),\"N/A\")))))","v":"N/A"}]
[{"$f":"A36&\"b\"","v":"3.2b"},"N/A",{"$f":"IF(B37=0,0,IF(B37=\"N/A\",\"N/A\",IF(B37=\"\",\"\",IF(_xlfn.STDEV.P(D37:CY37)=0,0,IFERROR(_xlfn.CONFIDENCE.T('background calcs'!$Q$4,_xlfn.STDEV.S(D37:CY37),COUNT(D37:CY37)),\"N/A\")))))","v":"N/A"}]
[null,"",{"$f":"IF(B38=0,0,IF(B38=\"N/A\",\"N/A\",IF(B38=\"\",\"\",IF(_xlfn.STDEV.P(D38:CY38)=0,0,IFERROR(_xlfn.CONFIDENCE.T('background calcs'!$Q$4,_xlfn.STDEV.S(D38:CY38),COUNT(D38:CY38)),\"N/A\")))))","v":""}]
[null,"",{"$f":"IF(B39=0,0,IF(B39=\"N/A\",\"N/A\",IF(B39=\"\",\"\",IF(_xlfn.STDEV.P(D39:CY39)=0,0,IFERROR(_xlfn.CONFIDENCE.T('background calcs'!$Q$4,_xlfn.STDEV.S(D39:CY39),COUNT(D39:CY39)),\"N/A\")))))","v":""}]
[{"$f":"A43&\"b\"","v":"3.3b"},"N/A",{"$f":"IF(B40=0,0,IF(B40=\"N/A\",\"N/A\",IF(B40=\"\",\"\",IF(_xlfn.STDEV.P(D40:CY40)=0,0,IFERROR(_xlfn.CONFIDENCE.T('background calcs'!$Q$4,_xlfn.STDEV.S(D40:CY40),COUNT(D40:CY40)),\"N/A\")))))","v":"N/A"}]
[{"$f":"A43&\"c\"","v":"3.3c"},"N/A",{"$f":"IF(B41=0,0,IF(B41=\"N/A\",\"N/A\",IF(B41=\"\",\"\",IF(_xlfn.STDEV.P(D41:CY41)=0,0,IFERROR(_xlfn.CONFIDENCE.T('background calcs'!$Q$4,_xlfn.STDEV.S(D41:CY41),COUNT(D41:CY41)),\"N/A\")))))","v":"N/A"}]
[null,"",{"$f":"IF(B42=0,0,IF(B42=\"N/A\",\"N/A\",IF(B42=\"\",\"\",IF(_xlfn.STDEV.P(D42:CY42)=0,0,IFERROR(_xlfn.CONFIDENCE.T('background calcs'!$Q$4,_xlfn.STDEV.S(D42:CY42),COUNT(D42:CY42)),\"N/A\")))))","v":""}]
[{"$f":"'Data entry template'!C44","v":3.3},0,{"$f":"IF(B43=0,0,IF(B43=\"N/A\",\"N/A\",IF(B43=\"\",\"\",IF(_xlfn.STDEV.P(D43:CY43)=0,0,IFERROR(_xlfn.CONFIDENCE.T('background calcs'!$Q$4,_xlfn.STDEV.S(D43:CY43),COUNT(D43:CY43)),\"N/A\")))))","v":0},0]
[null,"",{"$f":"IF(B44=0,0,IF(B44=\"N/A\",\"N/A\",IF(B44=\"\",\"\",IF(_xlfn.STDEV.P(D44:CY44)=0,0,IFERROR(_xlfn.CONFIDENCE.T('background calcs'!$Q$4,_xlfn.STDEV.S(D44:CY44),COUNT(D44:CY44)),\"N/A\")))))","v":""}]
[null,"",{"$f":"IF(B45=0,0,IF(B45=\"N/A\",\"N/A\",IF(B45=\"\",\"\",IF(_xlfn.STDEV.P(D45:CY45)=0,0,IFERROR(_xlfn.CONFIDENCE.T('background calcs'!$Q$4,_xlfn.STDEV.S(D45:CY45),COUNT(D45:CY45)),\"N/A\")))))","v":""}]
[{"$f":"A49&\"b\"","v":"3.4b"},"N/A",{"$f":"IF(B46=0,0,IF(B46=\"N/A\",\"N/A\",IF(B46=\"\",\"\",IF(_xlfn.STDEV.P(D46:CY46)=0,0,IFERROR(_xlfn.CONFIDENCE.T('background calcs'!$Q$4,_xlfn.STDEV.S(D46:CY46),COUNT(D46:CY46)),\"N/A\")))))","v":"N/A"}]
[{"$f":"A49&\"c\"","v":"3.4c"},"N/A",{"$f":"IF(B47=0,0,IF(B47=\"N/A\",\"N/A\",IF(B47=\"\",\"\",IF(_xlfn.STDEV.P(D47:CY47)=0,0,IFERROR(_xlfn.CONFIDENCE.T('background calcs'!$Q$4,_xlfn.STDEV.S(D47:CY47),COUNT(D47:CY47)),\"N/A\")))))","v":"N/A"}]
[null,"",{"$f":"IF(B48=0,0,IF(B48=\"N/A\",\"N/A\",IF(B48=\"\",\"\",IF(_xlfn.STDEV.P(D48:CY48)=0,0,IFERROR(_xlfn.CONFIDENCE.T('background calcs'!$Q$4,_xlfn.STDEV.S(D48:CY48),COUNT(D48:CY48)),\"N/A\")))))","v":""}]
[{"$f":"'Data entry template'!C50","v":3.4},0,{"$f":"IF(B49=0,0,IF(B49=\"N/A\",\"N/A\",IF(B49=\"\",\"\",IF(_xlfn.STDEV.P(D49:CY49)=0,0,IFERROR(_xlfn.CONFIDENCE.T('background calcs'!$Q$4,_xlfn.STDEV.S(D49:CY49),COUNT(D49:CY49)),\"N/A\")))))","v":0},0]
[null,"",{"$f":"IF(B50=0,0,IF(B50=\"N/A\",\"N/A\",IF(B50=\"\",\"\",IF(_xlfn.STDEV.P(D50:CY50)=0,0,IFERROR(_xlfn.CONFIDENCE.T('background calcs'!$Q$4,_xlfn.STDEV.S(D50:CY50),COUNT(D50:CY50)),\"N/A\")))))","v":""}]
[null,"",{"$f":"IF(B51=0,0,IF(B51=\"N/A\",\"N/A\",IF(B51=\"\",\"\",IF(_xlfn.STDEV.P(D51:CY51)=0,0,IFERROR(_xlfn.CONFIDENCE.T('background calcs'!$Q$4,_xlfn.STDEV.S(D51:CY51),COUNT(D51:CY51)),\"N/A\")))))","v":""}]
[null,"",{"$f":"IF(B52=0,0,IF(B52=\"N/A\",\"N/A\",IF(B52=\"\",\"\",IF(_xlfn.STDEV.P(D52:CY52)=0,0,IFERROR(_xlfn.CONFIDENCE.T('background calcs'!$Q$4,_xlfn.STDEV.S(D52:CY52),COUNT(D52:CY52)),\"N/A\")))))","v":""}]
[null,"",{"$f":"IF(B53=0,0,IF(B53=\"N/A\",\"N/A\",IF(B53=\"\",\"\",IF(_xlfn.STDEV.P(D53:CY53)=0,0,IFERROR(_xlfn.CONFIDENCE.T('background calcs'!$Q$4,_xlfn.STDEV.S(D53:CY53),COUNT(D53:CY53)),\"N/A\")))))","v":""}]
[null,"",{"$f":"IF(B54=0,0,IF(B54=\"N/A\",\"N/A\",IF(B54=\"\",\"\",IF(_xlfn.STDEV.P(D54:CY54)=0,0,IFERROR(_xlfn.CONFIDENCE.T('background calcs'!$Q$4,_xlfn.STDEV.S(D54:CY54),COUNT(D54:CY54)),\"N/A\")))))","v":""}]
[null,"",{"$f":"IF(B55=0,0,IF(B55=\"N/A\",\"N/A\",IF(B55=\"\",\"\",IF(_xlfn.STDEV.P(D55:CY55)=0,0,IFERROR(_xlfn.CONFIDENCE.T('background calcs'!$Q$4,_xlfn.STDEV.S(D55:CY55),COUNT(D55:CY55)),\"N/A\")))))","v":""}]
[null,"",{"$f":"IF(B56=0,0,IF(B56=\"N/A\",\"N/A\",IF(B56=\"\",\"\",IF(_xlfn.STDEV.P(D56:CY56)=0,0,IFERROR(_xlfn.CONFIDENCE.T('background calcs'!$Q$4,_xlfn.STDEV.S(D56:CY56),COUNT(D56:CY56)),\"N/A\")))))","v":""}]
[{"$f":"'Data entry template'!C56","v":3.5},{"$f":"IF(ISBLANK(A57),\"\",IF(COUNTBLANK(D57:CY57)>98,\"N/A\",IFERROR(AVERAGE(D57:CY57),\"\")))","v":"N/A"},{"$f":"IF(B57=0,0,IF(B57=\"N/A\",\"N/A\",IF(B57=\"\",\"\",IF(_xlfn.STDEV.P(D57:CY57)=0,0,IFERROR(_xlfn.CONFIDENCE.T('background calcs'!$Q$4,_xlfn.STDEV.S(D57:CY57),COUNT(D57:CY57)),\"N/A\")))))","v":"N/A"},0]
[{"$f":"A57&\"b\"","v":"3.5b"},{"$f":"IF(ISBLANK(A58),\"\",IF(COUNTBLANK(D58:CY58)>98,\"N/A\",IFERROR(AVERAGE(D58:CY58),\"\")))","v":"N/A"},{"$f":"IF(B58=0,0,IF(B58=\"N/A\",\"N/A\",IF(B58=\"\",\"\",IF(_xlfn.STDEV.P(D58:CY58)=0,0,IFERROR(_xlfn.CONFIDENCE.T('background calcs'!$Q$4,_xlfn.STDEV.S(D58:CY58),COUNT(D58:CY58)),\"N/A\")))))","v":"N/A"},0]
[null,"",{"$f":"IF(B59=0,0,IF(B59=\"N/A\",\"N/A\",IF(B59=\"\",\"\",IF(_xlfn.STDEV.P(D59:CY59)=0,0,IFERROR(_xlfn.CONFIDENCE.T('background calcs'!$Q$4,_xlfn.STDEV.S(D59:CY59),COUNT(D59:CY59)),\"N/A\")))))","v":""}]
[null,"",{"$f":"IF(B60=0,0,IF(B60=\"N/A\",\"N/A\",IF(B60=\"\",\"\",IF(_xlfn.STDEV.P(D60:CY60)=0,0,IFERROR(_xlfn.CONFIDENCE.T('background calcs'!$Q$4,_xlfn.STDEV.S(D60:CY60),COUNT(D60:CY60)),\"N/A\")))))","v":""}]
[null,"",{"$f":"IF(B61=0,0,IF(B61=\"N/A\",\"N/A\",IF(B61=\"\",\"\",IF(_xlfn.STDEV.P(D61:CY61)=0,0,IFERROR(_xlfn.CONFIDENCE.T('background calcs'!$Q$4,_xlfn.STDEV.S(D61:CY61),COUNT(D61:CY61)),\"N/A\")))))","v":""}]
[{"$f":"$A$68&\"a\"","v":"3.6a"},"N/A",{"$f":"IF(B62=0,0,IF(B62=\"N/A\",\"N/A\",IF(B62=\"\",\"\",IF(_xlfn.STDEV.P(D62:CY62)=0,0,IFERROR(_xlfn.CONFIDENCE.T('background calcs'!$Q$4,_xlfn.STDEV.S(D62:CY62),COUNT(D62:CY62)),\"N/A\")))))","v":"N/A"}]
[{"$f":"$A$68&\"b\"","v":"3.6b"},"N/A",{"$f":"IF(B63=0,0,IF(B63=\"N/A\",\"N/A\",IF(B63=\"\",\"\",IF(_xlfn.STDEV.P(D63:CY63)=0,0,IFERROR(_xlfn.CONFIDENCE.T('background calcs'!$Q$4,_xlfn.STDEV.S(D63:CY63),COUNT(D63:CY63)),\"N/A\")))))","v":"N/A"}]
[{"$f":"$A$68&\"c\"","v":"3.6c"},"N/A",{"$f":"IF(B64=0,0,IF(B64=\"N/A\",\"N/A\",IF(B64=\"\",\"\",IF(_xlfn.STDEV.P(D64:CY64)=0,0,IFERROR(_xlfn.CONFIDENCE.T('background calcs'!$Q$4,_xlfn.STDEV.S(D64:CY64),COUNT(D64:CY64)),\"N/A\")))))","v":"N/A"}]
[{"$f":"$A$68&\"d\"","v":"3.6d"},"N/A",{"$f":"IF(B65=0,0,IF(B65=\"N/A\",\"N/A\",IF(B65=\"\",\"\",IF(_xlfn.STDEV.P(D65:CY65)=0,0,IFERROR(_xlfn.CONFIDENCE.T('background calcs'!$Q$4,_xlfn.STDEV.S(D65:CY65),COUNT(D65:CY65)),\"N/A\")))))","v":"N/A"}]
[{"$f":"$A$68&\"e\"","v":"3.6e"},"N/A",{"$f":"IF(B66=0,0,IF(B66=\"N/A\",\"N/A\",IF(B66=\"\",\"\",IF(_xlfn.STDEV.P(D66:CY66)=0,0,IFERROR(_xlfn.CONFIDENCE.T('background calcs'!$Q$4,_xlfn.STDEV.S(D66:CY66),COUNT(D66:CY66)),\"N/A\")))))","v":"N/A"}]
[{"$f":"$A$68&\"f\"","v":"3.6f"},"N/A",{"$f":"IF(B67=0,0,IF(B67=\"N/A\",\"N/A\",IF(B67=\"\",\"\",IF(_xlfn.STDEV.P(D67:CY67)=0,0,IFERROR(_xlfn.CONFIDENCE.T('background calcs'!$Q$4,_xlfn.STDEV.S(D67:CY67),COUNT(D67:CY67)),\"N/A\")))))","v":"N/A"}]
[{"$f":"'Data entry template'!C66","v":3.6},{"$f":"IF(COUNTBLANK(D62:CY67)=600,\"N/A\",SUMIF(B62:B67,\">0\"))","v":"N/A"},{"$f":"AVERAGE(C62:C67)","v":{"$error":"#DIV/0!"}}]
[{"$f":"'Data entry template'!C74","v":3.7},{"$f":"IF(ISBLANK(A69),\"\",IF(COUNTBLANK(D69:CY69)=100,\"N/A\",IFERROR(AVERAGE(D69:CY69),\"\")))","v":"N/A"},{"$f":"IF(B69=0,0,IF(B69=\"N/A\",\"N/A\",IF(B69=\"\",\"\",IF(_xlfn.STDEV.P(D69:CY69)=0,0,IFERROR(_xlfn.CONFIDENCE.T('background calcs'!$Q$4,_xlfn.STDEV.S(D69:CY69),COUNT(D69:CY69)),\"N/A\")))))","v":"N/A"},""]
[{"$f":"A69&\"b\"","v":"3.7b"},1,{"$f":"IF(B70=0,0,IF(B70=\"N/A\",\"N/A\",IF(B70=\"\",\"\",IF(_xlfn.STDEV.P(D70:CY70)=0,0,IFERROR(_xlfn.CONFIDENCE.T('background calcs'!$Q$4,_xlfn.STDEV.S(D70:CY70),COUNT(D70:CY70)),\"N/A\")))))","v":0},1]
[null,"",{"$f":"IF(B71=0,0,IF(B71=\"N/A\",\"N/A\",IF(B71=\"\",\"\",IF(_xlfn.STDEV.P(D71:CY71)=0,0,IFERROR(_xlfn.CONFIDENCE.T('background calcs'!$Q$4,_xlfn.STDEV.S(D71:CY71),COUNT(D71:CY71)),\"N/A\")))))","v":""}]
[null,"",{"$f":"IF(B72=0,0,IF(B72=\"N/A\",\"N/A\",IF(B72=\"\",\"\",IF(_xlfn.STDEV.P(D72:CY72)=0,0,IFERROR(_xlfn.CONFIDENCE.T('background calcs'!$Q$4,_xlfn.STDEV.S(D72:CY72),COUNT(D72:CY72)),\"N/A\")))))","v":""}]
[null,"",{"$f":"IF(B73=0,0,IF(B73=\"N/A\",\"N/A\",IF(B73=\"\",\"\",IF(_xlfn.STDEV.P(D73:CY73)=0,0,IFERROR(_xlfn.CONFIDENCE.T('background calcs'!$Q$4,_xlfn.STDEV.S(D73:CY73),COUNT(D73:CY73)),\"N/A\")))))","v":""}]
[null,"",{"$f":"IF(B74=0,0,IF(B74=\"N/A\",\"N/A\",IF(B74=\"\",\"\",IF(_xlfn.STDEV.P(D74:CY74)=0,0,IFERROR(_xlfn.CONFIDENCE.T('background calcs'!$Q$4,_xlfn.STDEV.S(D74:CY74),COUNT(D74:CY74)),\"N/A\")))))","v":""}]
[{"$f":"'Data entry template'!C80","v":3.8},"N/A",{"$f":"IF(B75=0,0,IF(B75=\"N/A\",\"N/A\",IF(B75=\"\",\"\",IF(_xlfn.STDEV.P(D75:CY75)=0,0,IFERROR(_xlfn.CONFIDENCE.T('background calcs'!$Q$4,_xlfn.STDEV.S(D75:CY75),COUNT(D75:CY75)),\"N/A\")))))","v":"N/A"},""]
[null,"",{"$f":"IF(B76=0,0,IF(B76=\"N/A\",\"N/A\",IF(B76=\"\",\"\",IF(_xlfn.STDEV.P(D76:CY76)=0,0,IFERROR(_xlfn.CONFIDENCE.T('background calcs'!$Q$4,_xlfn.STDEV.S(D76:CY76),COUNT(D76:CY76)),\"N/A\")))))","v":""}]
[null,"",{"$f":"IF(B77=0,0,IF(B77=\"N/A\",\"N/A\",IF(B77=\"\",\"\",IF(_xlfn.STDEV.P(D77:CY77)=0,0,IFERROR(_xlfn.CONFIDENCE.T('background calcs'!$Q$4,_xlfn.STDEV.S(D77:CY77),COUNT(D77:CY77)),\"N/A\")))))","v":""}]
[null,"",{"$f":"IF(B78=0,0,IF(B78=\"N/A\",\"N/A\",IF(B78=\"\",\"\",IF(_xlfn.STDEV.P(D78:CY78)=0,0,IFERROR(_xlfn.CONFIDENCE.T('background calcs'!$Q$4,_xlfn.STDEV.S(D78:CY78),COUNT(D78:CY78)),\"N/A\")))))","v":""}]
[null,"",{"$f":"IF(B79=0,0,IF(B79=\"N/A\",\"N/A\",IF(B79=\"\",\"\",IF(_xlfn.STDEV.P(D79:CY79)=0,0,IFERROR(_xlfn.CONFIDENCE.T('background calcs'!$Q$4,_xlfn.STDEV.S(D79:CY79),COUNT(D79:CY79)),\"N/A\")))))","v":""}]
[null,"",{"$f":"IF(B80=0,0,IF(B80=\"N/A\",\"N/A\",IF(B80=\"\",\"\",IF(_xlfn.STDEV.P(D80:CY80)=0,0,IFERROR(_xlfn.CONFIDENCE.T('background calcs'!$Q$4,_xlfn.STDEV.S(D80:CY80),COUNT(D80:CY80)),\"N/A\")))))","v":""}]
[null,"",{"$f":"IF(B81=0,0,IF(B81=\"N/A\",\"N/A\",IF(B81=\"\",\"\",IF(_xlfn.STDEV.P(D81:CY81)=0,0,IFERROR(_xlfn.CONFIDENCE.T('background calcs'!$Q$4,_xlfn.STDEV.S(D81:CY81),COUNT(D81:CY81)),\"N/A\")))))","v":""}]
[{"$f":"'Data entry template'!C86","v":3.9},"N/A",{"$f":"IF(B82=0,0,IF(B82=\"N/A\",\"N/A\",IF(B82=\"\",\"\",IF(_xlfn.STDEV.P(D82:CY82)=0,0,IFERROR(_xlfn.CONFIDENCE.T('background calcs'!$Q$4,_xlfn.STDEV.S(D82:CY82),COUNT(D82:CY82)),\"N/A\")))))","v":"N/A"}]
[null,"",{"$f":"IF(B83=0,0,IF(B83=\"N/A\",\"N/A\",IF(B83=\"\",\"\",IF(_xlfn.STDEV.P(D83:CY83)=0,0,IFERROR(_xlfn.CONFIDENCE.T('background calcs'!$Q$4,_xlfn.STDEV.S(D83:CY83),COUNT(D83:CY83)),\"N/A\")))))","v":""}]
[null,"",{"$f":"IF(B84=0,0,IF(B84=\"N/A\",\"N/A\",IF(B84=\"\",\"\",IF(_xlfn.STDEV.P(D84:CY84)=0,0,IFERROR(_xlfn.CONFIDENCE.T('background calcs'!$Q$4,_xlfn.STDEV.S(D84:CY84),COUNT(D84:CY84)),\"N/A\")))))","v":""}]
[{"$f":"TEXT('Data entry template'!C89,\".00\")","v":"3.10"},"N/A",{"$f":"IF(B85=0,0,IF(B85=\"N/A\",\"N/A\",IF(B85=\"\",\"\",IF(_xlfn.STDEV.P(D85:CY85)=0,0,IFERROR(_xlfn.CONFIDENCE.T('background calcs'!$Q$4,_xlfn.STDEV.S(D85:CY85),COUNT(D85:CY85)),\"N/A\")))))","v":"N/A"}]
[null,"",{"$f":"IF(B86=0,0,IF(B86=\"N/A\",\"N/A\",IF(B86=\"\",\"\",IF(_xlfn.STDEV.P(D86:CY86)=0,0,IFERROR(_xlfn.CONFIDENCE.T('background calcs'!$Q$4,_xlfn.STDEV.S(D86:CY86),COUNT(D86:CY86)),\"N/A\")))))","v":""}]
[null,"",{"$f":"IF(B87=0,0,IF(B87=\"N/A\",\"N/A\",IF(B87=\"\",\"\",IF(_xlfn.STDEV.P(D87:CY87)=0,0,IFERROR(_xlfn.CONFIDENCE.T('background calcs'!$Q$4,_xlfn.STDEV.S(D87:CY87),COUNT(D87:CY87)),\"N/A\")))))","v":""}]
[null,"",{"$f":"IF(B88=0,0,IF(B88=\"N/A\",\"N/A\",IF(B88=\"\",\"\",IF(_xlfn.STDEV.P(D88:CY88)=0,0,IFERROR(_xlfn.CONFIDENCE.T('background calcs'!$Q$4,_xlfn.STDEV.S(D88:CY88),COUNT(D88:CY88)),\"N/A\")))))","v":""}]
[null,"",{"$f":"IF(B89=0,0,IF(B89=\"N/A\",\"N/A\",IF(B89=\"\",\"\",IF(_xlfn.STDEV.P(D89:CY89)=0,0,IFERROR(_xlfn.CONFIDENCE.T('background calcs'!$Q$4,_xlfn.STDEV.S(D89:CY89),COUNT(D89:CY89)),\"N/A\")))))","v":""}]
[{"$f":"'Data entry template'!C93","v":4.0999999999999996},"N/A",{"$f":"IF(B90=0,0,IF(B90=\"N/A\",\"N/A\",IF(B90=\"\",\"\",IF(_xlfn.STDEV.P(D90:CY90)=0,0,IFERROR(_xlfn.CONFIDENCE.T('background calcs'!$Q$4,_xlfn.STDEV.S(D90:CY90),COUNT(D90:CY90)),\"N/A\")))))","v":"N/A"}]
[null,"",{"$f":"IF(B91=0,0,IF(B91=\"N/A\",\"N/A\",IF(B91=\"\",\"\",IF(_xlfn.STDEV.P(D91:CY91)=0,0,IFERROR(_xlfn.CONFIDENCE.T('background calcs'!$Q$4,_xlfn.STDEV.S(D91:CY91),COUNT(D91:CY91)),\"N/A\")))))","v":""}]
[null,"",{"$f":"IF(B92=0,0,IF(B92=\"N/A\",\"N/A\",IF(B92=\"\",\"\",IF(_xlfn.STDEV.P(D92:CY92)=0,0,IFERROR(_xlfn.CONFIDENCE.T('background calcs'!$Q$4,_xlfn.STDEV.S(D92:CY92),COUNT(D92:CY92)),\"N/A\")))))","v":""}]
[null,"",{"$f":"IF(B93=0,0,IF(B93=\"N/A\",\"N/A\",IF(B93=\"\",\"\",IF(_xlfn.STDEV.P(D93:CY93)=0,0,IFERROR(_xlfn.CONFIDENCE.T('background calcs'!$Q$4,_xlfn.STDEV.S(D93:CY93),COUNT(D93:CY93)),\"N/A\")))))","v":""}]
[{"$f":"'Data entry template'!C97","v":4.2},"N/A",{"$f":"IF(B94=0,0,IF(B94=\"N/A\",\"N/A\",IF(B94=\"\",\"\",IF(_xlfn.STDEV.P(D94:CY94)=0,0,IFERROR(_xlfn.CONFIDENCE.T('background calcs'!$Q$4,_xlfn.STDEV.S(D94:CY94),COUNT(D94:CY94)),\"N/A\")))))","v":"N/A"}]
[null,"",{"$f":"IF(B95=0,0,IF(B95=\"N/A\",\"N/A\",IF(B95=\"\",\"\",IF(_xlfn.STDEV.P(D95:CY95)=0,0,IFERROR(_xlfn.CONFIDENCE.T('background calcs'!$Q$4,_xlfn.STDEV.S(D95:CY95),COUNT(D95:CY95)),\"N/A\")))))","v":""}]
[null,"",{"$f":"IF(B96=0,0,IF(B96=\"N/A\",\"N/A\",IF(B96=\"\",\"\",IF(_xlfn.STDEV.P(D96:CY96)=0,0,IFERROR(_xlfn.CONFIDENCE.T('background calcs'!$Q$4,_xlfn.STDEV.S(D96:CY96),COUNT(D96:CY96)),\"N/A\")))))","v":""}]
[null,"",{"$f":"IF(B97=0,0,IF(B97=\"N/A\",\"N/A\",IF(B97=\"\",\"\",IF(_xlfn.STDEV.P(D97:CY97)=0,0,IFERROR(_xlfn.CONFIDENCE.T('background calcs'!$Q$4,_xlfn.STDEV.S(D97:CY97),COUNT(D97:CY97)),\"N/A\")))))","v":""}]
[{"$f":"'Data entry template'!C101","v":4.3},"N/A",{"$f":"IF(B98=0,0,IF(B98=\"N/A\",\"N/A\",IF(B98=\"\",\"\",IF(_xlfn.STDEV.P(D98:CY98)=0,0,IFERROR(_xlfn.CONFIDENCE.T('background calcs'!$Q$4,_xlfn.STDEV.S(D98:CY98),COUNT(D98:CY98)),\"N/A\")))))","v":"N/A"}]
[null,"",{"$f":"IF(B99=0,0,IF(B99=\"N/A\",\"N/A\",IF(B99=\"\",\"\",IF(_xlfn.STDEV.P(D99:CY99)=0,0,IFERROR(_xlfn.CONFIDENCE.T('background calcs'!$Q$4,_xlfn.STDEV.S(D99:CY99),COUNT(D99:CY99)),\"N/A\")))))","v":""}]
[null,"",{"$f":"IF(B100=0,0,IF(B100=\"N/A\",\"N/A\",IF(B100=\"\",\"\",IF(_xlfn.STDEV.P(D100:CY100)=0,0,IFERROR(_xlfn.CONFIDENCE.T('background calcs'!$Q$4,_xlfn.STDEV.S(D100:CY100),COUNT(D100:CY100)),\"N/A\")))))","v":""}]
[null,"",{"$f":"IF(B101=0,0,IF(B101=\"N/A\",\"N/A\",IF(B101=\"\",\"\",IF(_xlfn.STDEV.P(D101:CY101)=0,0,IFERROR(_xlfn.CONFIDENCE.T('background calcs'!$Q$4,_xlfn.STDEV.S(D101:CY101),COUNT(D101:CY101)),\"N/A\")))))","v":""}]
[{"$f":"A103&\"b\"","v":"4.4b"},"N/A",{"$f":"IF(B102=0,0,IF(B102=\"N/A\",\"N/A\",IF(B102=\"\",\"\",IF(_xlfn.STDEV.P(D102:CY102)=0,0,IFERROR(_xlfn.CONFIDENCE.T('background calcs'!$Q$4,_xlfn.STDEV.S(D102:CY102),COUNT(D102:CY102)),\"N/A\")))))","v":"N/A"}]
[{"$f":"'Data entry template'!C105","v":4.4000000000000004},"N/A",{"$f":"IF(B103=0,0,IF(B103=\"N/A\",\"N/A\",IF(B103=\"\",\"\",IF(_xlfn.STDEV.P(D103:CY103)=0,0,IFERROR(_xlfn.CONFIDENCE.T('background calcs'!$Q$4,_xlfn.STDEV.S(D103:CY103),COUNT(D103:CY103)),\"N/A\")))))","v":"N/A"}]
[null,"",{"$f":"IF(B104=0,0,IF(B104=\"N/A\",\"N/A\",IF(B104=\"\",\"\",IF(_xlfn.STDEV.P(D104:CY104)=0,0,IFERROR(_xlfn.CONFIDENCE.T('background calcs'!$Q$4,_xlfn.STDEV.S(D104:CY104),COUNT(D104:CY104)),\"N/A\")))))","v":""}]
[null,"",{"$f":"IF(B105=0,0,IF(B105=\"N/A\",\"N/A\",IF(B105=\"\",\"\",IF(_xlfn.STDEV.P(D105:CY105)=0,0,IFERROR(_xlfn.CONFIDENCE.T('background calcs'!$Q$4,_xlfn.STDEV.S(D105:CY105),COUNT(D105:CY105)),\"N/A\")))))","v":""}]
[null,"",{"$f":"IF(B106=0,0,IF(B106=\"N/A\",\"N/A\",IF(B106=\"\",\"\",IF(_xlfn.STDEV.P(D106:CY106)=0,0,IFERROR(_xlfn.CONFIDENCE.T('background calcs'!$Q$4,_xlfn.STDEV.S(D106:CY106),COUNT(D106:CY106)),\"N/A\")))))","v":""}]
[{"$f":"'Data entry template'!C110","v":"4.5 A"},"N/A",{"$f":"IF(B107=0,0,IF(B107=\"N/A\",\"N/A\",IF(B107=\"\",\"\",IF(_xlfn.STDEV.P(D107:CY107)=0,0,IFERROR(_xlfn.CONFIDENCE.T('background calcs'!$Q$4,_xlfn.STDEV.S(D107:CY107),COUNT(D107:CY107)),\"N/A\")))))","v":"N/A"}]
[null,"",{"$f":"IF(B108=0,0,IF(B108=\"N/A\",\"N/A\",IF(B108=\"\",\"\",IF(_xlfn.STDEV.P(D108:CY108)=0,0,IFERROR(_xlfn.CONFIDENCE.T('background calcs'!$Q$4,_xlfn.STDEV.S(D108:CY108),COUNT(D108:CY108)),\"N/A\")))))","v":""}]
[null,"",{"$f":"IF(B109=0,0,IF(B109=\"N/A\",\"N/A\",IF(B109=\"\",\"\",IF(_xlfn.STDEV.P(D109:CY109)=0,0,IFERROR(_xlfn.CONFIDENCE.T('background calcs'!$Q$4,_xlfn.STDEV.S(D109:CY109),COUNT(D109:CY109)),\"N/A\")))))","v":""}]
[{"$f":"'Data entry template'!C114","v":"Notes:"},"N/A",{"$f":"IF(B110=0,0,IF(B110=\"N/A\",\"N/A\",IF(B110=\"\",\"\",IF(_xlfn.STDEV.P(D110:CY110)=0,0,IFERROR(_xlfn.CONFIDENCE.T('background calcs'!$Q$4,_xlfn.STDEV.S(D110:CY110),COUNT(D110:CY110)),\"N/A\")))))","v":"N/A"}]
[null,"",{"$f":"IF(B111=0,0,IF(B111=\"N/A\",\"N/A\",IF(B111=\"\",\"\",IF(_xlfn.STDEV.P(D111:CY111)=0,0,IFERROR(_xlfn.CONFIDENCE.T('background calcs'!$Q$4,_xlfn.STDEV.S(D111:CY111),COUNT(D111:CY111)),\"N/A\")))))","v":""}]
[{"$f":"'Data entry template'!C116","v":"4.5 B"},"N/A",{"$f":"IF(B112=0,0,IF(B112=\"N/A\",\"N/A\",IF(B112=\"\",\"\",IF(_xlfn.STDEV.P(D112:CY112)=0,0,IFERROR(_xlfn.CONFIDENCE.T('background calcs'!$Q$4,_xlfn.STDEV.S(D112:CY112),COUNT(D112:CY112)),\"N/A\")))))","v":"N/A"},""]
[null,"",{"$f":"IF(B113=0,0,IF(B113=\"N/A\",\"N/A\",IF(B113=\"\",\"\",IF(_xlfn.STDEV.P(D113:CY113)=0,0,IFERROR(_xlfn.CONFIDENCE.T('background calcs'!$Q$4,_xlfn.STDEV.S(D113:CY113),COUNT(D113:CY113)),\"N/A\")))))","v":""}]
[null,"",{"$f":"IF(B114=0,0,IF(B114=\"N/A\",\"N/A\",IF(B114=\"\",\"\",IF(_xlfn.STDEV.P(D114:CY114)=0,0,IFERROR(_xlfn.CONFIDENCE.T('background calcs'!$Q$4,_xlfn.STDEV.S(D114:CY114),COUNT(D114:CY114)),\"N/A\")))))","v":""}]
[null,"",{"$f":"IF(B115=0,0,IF(B115=\"N/A\",\"N/A\",IF(B115=\"\",\"\",IF(_xlfn.STDEV.P(D115:CY115)=0,0,IFERROR(_xlfn.CONFIDENCE.T('background calcs'!$Q$4,_xlfn.STDEV.S(D115:CY115),COUNT(D115:CY115)),\"N/A\")))))","v":""}]
[null,"",{"$f":"IF(B116=0,0,IF(B116=\"N/A\",\"N/A\",IF(B116=\"\",\"\",IF(_xlfn.STDEV.P(D116:CY116)=0,0,IFERROR(_xlfn.CONFIDENCE.T('background calcs'!$Q$4,_xlfn.STDEV.S(D116:CY116),COUNT(D116:CY116)),\"N/A\")))))","v":""}]
[null,"",{"$f":"IF(B117=0,0,IF(B117=\"N/A\",\"N/A\",IF(B117=\"\",\"\",IF(_xlfn.STDEV.P(D117:CY117)=0,0,IFERROR(_xlfn.CONFIDENCE.T('background calcs'!$Q$4,_xlfn.STDEV.S(D117:CY117),COUNT(D117:CY117)),\"N/A\")))))","v":""}]
[null,"",{"$f":"IF(B118=0,0,IF(B118=\"N/A\",\"N/A\",IF(B118=\"\",\"\",IF(_xlfn.STDEV.P(D118:CY118)=0,0,IFERROR(_xlfn.CONFIDENCE.T('background calcs'!$Q$4,_xlfn.STDEV.S(D118:CY118),COUNT(D118:CY118)),\"N/A\")))))","v":""}]
[null,"",{"$f":"IF(B119=0,0,IF(B119=\"N/A\",\"N/A\",IF(B119=\"\",\"\",IF(_xlfn.STDEV.P(D119:CY119)=0,0,IFERROR(_xlfn.CONFIDENCE.T('background calcs'!$Q$4,_xlfn.STDEV.S(D119:CY119),COUNT(D119:CY119)),\"N/A\")))))","v":""}]
[{"$f":"'Data entry template'!C124","v":4.5999999999999996},"N/A",{"$f":"IF(B120=0,0,IF(B120=\"N/A\",\"N/A\",IF(B120=\"\",\"\",IF(_xlfn.STDEV.P(D120:CY120)=0,0,IFERROR(_xlfn.CONFIDENCE.T('background calcs'!$Q$4,_xlfn.STDEV.S(D120:CY120),COUNT(D120:CY120)),\"N/A\")))))","v":"N/A"},""]
[null,"",{"$f":"IF(B121=0,0,IF(B121=\"N/A\",\"N/A\",IF(B121=\"\",\"\",IF(_xlfn.STDEV.P(D121:CY121)=0,0,IFERROR(_xlfn.CONFIDENCE.T('background calcs'!$Q$4,_xlfn.STDEV.S(D121:CY121),COUNT(D121:CY121)),\"N/A\")))))","v":""}]
[null,"",{"$f":"IF(B122=0,0,IF(B122=\"N/A\",\"N/A\",IF(B122=\"\",\"\",IF(_xlfn.STDEV.P(D122:CY122)=0,0,IFERROR(_xlfn.CONFIDENCE.T('background calcs'!$Q$4,_xlfn.STDEV.S(D122:CY122),COUNT(D122:CY122)),\"N/A\")))))","v":""}]
[null,"",{"$f":"IF(B123=0,0,IF(B123=\"N/A\",\"N/A\",IF(B123=\"\",\"\",IF(_xlfn.STDEV.P(D123:CY123)=0,0,IFERROR(_xlfn.CONFIDENCE.T('background calcs'!$Q$4,_xlfn.STDEV.S(D123:CY123),COUNT(D123:CY123)),\"N/A\")))))","v":""}]
[null,"",{"$f":"IF(B124=0,0,IF(B124=\"N/A\",\"N/A\",IF(B124=\"\",\"\",IF(_xlfn.STDEV.P(D124:CY124)=0,0,IFERROR(_xlfn.CONFIDENCE.T('background calcs'!$Q$4,_xlfn.STDEV.S(D124:CY124),COUNT(D124:CY124)),\"N/A\")))))","v":""}]
[null,"",{"$f":"IF(B125=0,0,IF(B125=\"N/A\",\"N/A\",IF(B125=\"\",\"\",IF(_xlfn.STDEV.P(D125:CY125)=0,0,IFERROR(_xlfn.CONFIDENCE.T('background calcs'!$Q$4,_xlfn.STDEV.S(D125:CY125),COUNT(D125:CY125)),\"N/A\")))))","v":""}]
[null,"",{"$f":"IF(B126=0,0,IF(B126=\"N/A\",\"N/A\",IF(B126=\"\",\"\",IF(_xlfn.STDEV.P(D126:CY126)=0,0,IFERROR(_xlfn.CONFIDENCE.T('background calcs'!$Q$4,_xlfn.STDEV.S(D126:CY126),COUNT(D126:CY126)),\"N/A\")))))","v":""}]
[null,"",{"$f":"IF(B127=0,0,IF(B127=\"N/A\",\"N/A\",IF(B127=\"\",\"\",IF(_xlfn.STDEV.P(D127:CY127)=0,0,IFERROR(_xlfn.CONFIDENCE.T('background calcs'!$Q$4,_xlfn.STDEV.S(D127:CY127),COUNT(D127:CY127)),\"N/A\")))))","v":""}]
[null,"",{"$f":"IF(B128=0,0,IF(B128=\"N/A\",\"N/A\",IF(B128=\"\",\"\",IF(_xlfn.STDEV.P(D128:CY128)=0,0,IFERROR(_xlfn.CONFIDENCE.T('background calcs'!$Q$4,_xlfn.STDEV.S(D128:CY128),COUNT(D128:CY128)),\"N/A\")))))","v":""}]
[{"$f":"'Data entry template'!C133","v":"Notes:"},"N/A",{"$f":"IF(B129=0,0,IF(B129=\"N/A\",\"N/A\",IF(B129=\"\",\"\",IF(_xlfn.STDEV.P(D129:CY129)=0,0,IFERROR(_xlfn.CONFIDENCE.T('background calcs'!$Q$4,_xlfn.STDEV.S(D129:CY129),COUNT(D129:CY129)),\"N/A\")))))","v":"N/A"}]
[null,"",{"$f":"IF(B130=0,0,IF(B130=\"N/A\",\"N/A\",IF(B130=\"\",\"\",IF(_xlfn.STDEV.P(D130:CY130)=0,0,IFERROR(_xlfn.CONFIDENCE.T('background calcs'!$Q$4,_xlfn.STDEV.S(D130:CY130),COUNT(D130:CY130)),\"N/A\")))))","v":""}]
[null,"",{"$f":"IF(B131=0,0,IF(B131=\"N/A\",\"N/A\",IF(B131=\"\",\"\",IF(_xlfn.STDEV.P(D131:CY131)=0,0,IFERROR(_xlfn.CONFIDENCE.T('background calcs'!$Q$4,_xlfn.STDEV.S(D131:CY131),COUNT(D131:CY131)),\"N/A\")))))","v":""}]
[{"$f":"'Data entry template'!C135","v":"4.7 A"},"N/A",{"$f":"IF(B132=0,0,IF(B132=\"N/A\",\"N/A\",IF(B132=\"\",\"\",IF(_xlfn.STDEV.P(D132:CY132)=0,0,IFERROR(_xlfn.CONFIDENCE.T('background calcs'!$Q$4,_xlfn.STDEV.S(D132:CY132),COUNT(D132:CY132)),\"N/A\")))))","v":"N/A"}]
[null,{"$f":"IF(ISBLANK(A133),\"\",IF(COUNTBLANK(D133:CY133)=100,\"N/A\",IFERROR(AVERAGE(D133:CY133),\"\")))","v":""},{"$f":"IF(B133=0,0,IF(B133=\"N/A\",\"N/A\",IF(B133=\"\",\"\",IF(_xlfn.STDEV.P(D133:CY133)=0,0,IFERROR(_xlfn.CONFIDENCE.T('background calcs'!$Q$4,_xlfn.STDEV.S(D133:CY133),COUNT(D133:CY133)),\"N/A\")))))","v":""}]
[null,"",{"$f":"IF(B134=0,0,IF(B134=\"N/A\",\"N/A\",IF(B134=\"\",\"\",IF(_xlfn.STDEV.P(D134:CY134)=0,0,IFERROR(_xlfn.CONFIDENCE.T('background calcs'!$Q$4,_xlfn.STDEV.S(D134:CY134),COUNT(D134:CY134)),\"N/A\")))))","v":""}]
[{"$f":"'Data entry template'!C139","v":"Notes:"},"N/A",{"$f":"IF(B135=0,0,IF(B135=\"N/A\",\"N/A\",IF(B135=\"\",\"\",IF(_xlfn.STDEV.P(D135:CY135)=0,0,IFERROR(_xlfn.CONFIDENCE.T('background calcs'!$Q$4,_xlfn.STDEV.S(D135:CY135),COUNT(D135:CY135)),\"N/A\")))))","v":"N/A"}]
[null,"",{"$f":"IF(B136=0,0,IF(B136=\"N/A\",\"N/A\",IF(B136=\"\",\"\",IF(_xlfn.STDEV.P(D136:CY136)=0,0,IFERROR(_xlfn.CONFIDENCE.T('background calcs'!$Q$4,_xlfn.STDEV.S(D136:CY136),COUNT(D136:CY136)),\"N/A\")))))","v":""}]
[{"$f":"'Data entry template'!C141","v":"4.7 B"},"N/A",{"$f":"IF(B137=0,0,IF(B137=\"N/A\",\"N/A\",IF(B137=\"\",\"\",IF(_xlfn.STDEV.P(D137:CY137)=0,0,IFERROR(_xlfn.CONFIDENCE.T('background calcs'!$Q$4,_xlfn.STDEV.S(D137:CY137),COUNT(D137:CY137)),\"N/A\")))))","v":"N/A"},""]
[null,"",{"$f":"IF(B138=0,0,IF(B138=\"N/A\",\"N/A\",IF(B138=\"\",\"\",IF(_xlfn.STDEV.P(D138:CY138)=0,0,IFERROR(_xlfn.CONFIDENCE.T('background calcs'!$Q$4,_xlfn.STDEV.S(D138:CY138),COUNT(D138:CY138)),\"N/A\")))))","v":""}]
[null,"",{"$f":"IF(B139=0,0,IF(B139=\"N/A\",\"N/A\",IF(B139=\"\",\"\",IF(_xlfn.STDEV.P(D139:CY139)=0,0,IFERROR(_xlfn.CONFIDENCE.T('background calcs'!$Q$4,_xlfn.STDEV.S(D139:CY139),COUNT(D139:CY139)),\"N/A\")))))","v":""}]
[null,"",{"$f":"IF(B140=0,0,IF(B140=\"N/A\",\"N/A\",IF(B140=\"\",\"\",IF(_xlfn.STDEV.P(D140:CY140)=0,0,IFERROR(_xlfn.CONFIDENCE.T('background calcs'!$Q$4,_xlfn.STDEV.S(D140:CY140),COUNT(D140:CY140)),\"N/A\")))))","v":""}]
[null,"",{"$f":"IF(B141=0,0,IF(B141=\"N/A\",\"N/A\",IF(B141=\"\",\"\",IF(_xlfn.STDEV.P(D141:CY141)=0,0,IFERROR(_xlfn.CONFIDENCE.T('background calcs'!$Q$4,_xlfn.STDEV.S(D141:CY141),COUNT(D141:CY141)),\"N/A\")))))","v":""}]
[null,"",{"$f":"IF(B142=0,0,IF(B142=\"N/A\",\"N/A\",IF(B142=\"\",\"\",IF(_xlfn.STDEV.P(D142:CY142)=0,0,IFERROR(_xlfn.CONFIDENCE.T('background calcs'!$Q$4,_xlfn.STDEV.S(D142:CY142),COUNT(D142:CY142)),\"N/A\")))))","v":""}]
[null,"",{"$f":"IF(B143=0,0,IF(B143=\"N/A\",\"N/A\",IF(B143=\"\",\"\",IF(_xlfn.STDEV.P(D143:CY143)=0,0,IFERROR(_xlfn.CONFIDENCE.T('background calcs'!$Q$4,_xlfn.STDEV.S(D143:CY143),COUNT(D143:CY143)),\"N/A\")))))","v":""}]
[null,"",{"$f":"IF(B144=0,0,IF(B144=\"N/A\",\"N/A\",IF(B144=\"\",\"\",IF(_xlfn.STDEV.P(D144:CY144)=0,0,IFERROR(_xlfn.CONFIDENCE.T('background calcs'!$Q$4,_xlfn.STDEV.S(D144:CY144),COUNT(D144:CY144)),\"N/A\")))))","v":""}]
[{"$f":"'Data entry template'!C149","v":"4.8 A"},"N/A",{"$f":"IF(B145=0,0,IF(B145=\"N/A\",\"N/A\",IF(B145=\"\",\"\",IF(_xlfn.STDEV.P(D145:CY145)=0,0,IFERROR(_xlfn.CONFIDENCE.T('background calcs'!$Q$4,_xlfn.STDEV.S(D145:CY145),COUNT(D145:CY145)),\"N/A\")))))","v":"N/A"},""]
[null,"",{"$f":"IF(B146=0,0,IF(B146=\"N/A\",\"N/A\",IF(B146=\"\",\"\",IF(_xlfn.STDEV.P(D146:CY146)=0,0,IFERROR(_xlfn.CONFIDENCE.T('background calcs'!$Q$4,_xlfn.STDEV.S(D146:CY146),COUNT(D146:CY146)),\"N/A\")))))","v":""}]
[null,"",{"$f":"IF(B147=0,0,IF(B147=\"N/A\",\"N/A\",IF(B147=\"\",\"\",IF(_xlfn.STDEV.P(D147:CY147)=0,0,IFERROR(_xlfn.CONFIDENCE.T('background calcs'!$Q$4,_xlfn.STDEV.S(D147:CY147),COUNT(D147:CY147)),\"N/A\")))))","v":""}]
[null,"",{"$f":"IF(B148=0,0,IF(B148=\"N/A\",\"N/A\",IF(B148=\"\",\"\",IF(_xlfn.STDEV.P(D148:CY148)=0,0,IFERROR(_xlfn.CONFIDENCE.T('background calcs'!$Q$4,_xlfn.STDEV.S(D148:CY148),COUNT(D148:CY148)),\"N/A\")))))","v":""}]
[null,"",{"$f":"IF(B149=0,0,IF(B149=\"N/A\",\"N/A\",IF(B149=\"\",\"\",IF(_xlfn.STDEV.P(D149:CY149)=0,0,IFERROR(_xlfn.CONFIDENCE.T('background calcs'!$Q$4,_xlfn.STDEV.S(D149:CY149),COUNT(D149:CY149)),\"N/A\")))))","v":""}]
[null,"",{"$f":"IF(B150=0,0,IF(B150=\"N/A\",\"N/A\",IF(B150=\"\",\"\",IF(_xlfn.STDEV.P(D150:CY150)=0,0,IFERROR(_xlfn.CONFIDENCE.T('background calcs'!$Q$4,_xlfn.STDEV.S(D150:CY150),COUNT(D150:CY150)),\"N/A\")))))","v":""}]
[null,"",{"$f":"IF(B151=0,0,IF(B151=\"N/A\",\"N/A\",IF(B151=\"\",\"\",IF(_xlfn.STDEV.P(D151:CY151)=0,0,IFERROR(_xlfn.CONFIDENCE.T('background calcs'!$Q$4,_xlfn.STDEV.S(D151:CY151),COUNT(D151:CY151)),\"N/A\")))))","v":""}]
[null,"",{"$f":"IF(B152=0,0,IF(B152=\"N/A\",\"N/A\",IF(B152=\"\",\"\",IF(_xlfn.STDEV.P(D152:CY152)=0,0,IFERROR(_xlfn.CONFIDENCE.T('background calcs'!$Q$4,_xlfn.STDEV.S(D152:CY152),COUNT(D152:CY152)),\"N/A\")))))","v":""}]
[{"$f":"'Data entry template'!C157","v":"4.8 B"},"N/A",{"$f":"IF(B153=0,0,IF(B153=\"N/A\",\"N/A\",IF(B153=\"\",\"\",IF(_xlfn.STDEV.P(D153:CY153)=0,0,IFERROR(_xlfn.CONFIDENCE.T('background calcs'!$Q$4,_xlfn.STDEV.S(D153:CY153),COUNT(D153:CY153)),\"N/A\")))))","v":"N/A"},""]
[null,"",{"$f":"IF(B154=0,0,IF(B154=\"N/A\",\"N/A\",IF(B154=\"\",\"\",IF(_xlfn.STDEV.P(D154:CY154)=0,0,IFERROR(_xlfn.CONFIDENCE.T('background calcs'!$Q$4,_xlfn.STDEV.S(D154:CY154),COUNT(D154:CY154)),\"N/A\")))))","v":""}]
[null,"",{"$f":"IF(B155=0,0,IF(B155=\"N/A\",\"N/A\",IF(B155=\"\",\"\",IF(_xlfn.STDEV.P(D155:CY155)=0,0,IFERROR(_xlfn.CONFIDENCE.T('background calcs'!$Q$4,_xlfn.STDEV.S(D155:CY155),COUNT(D155:CY155)),\"N/A\")))))","v":""}]
[null,"",{"$f":"IF(B156=0,0,IF(B156=\"N/A\",\"N/A\",IF(B156=\"\",\"\",IF(_xlfn.STDEV.P(D156:CY156)=0,0,IFERROR(_xlfn.CONFIDENCE.T('background calcs'!$Q$4,_xlfn.STDEV.S(D156:CY156),COUNT(D156:CY156)),\"N/A\")))))","v":""}]
[null,"",{"$f":"IF(B157=0,0,IF(B157=\"N/A\",\"N/A\",IF(B157=\"\",\"\",IF(_xlfn.STDEV.P(D157:CY157)=0,0,IFERROR(_xlfn.CONFIDENCE.T('background calcs'!$Q$4,_xlfn.STDEV.S(D157:CY157),COUNT(D157:CY157)),\"N/A\")))))","v":""}]
[null,"",{"$f":"IF(B158=0,0,IF(B158=\"N/A\",\"N/A\",IF(B158=\"\",\"\",IF(_xlfn.STDEV.P(D158:CY158)=0,0,IFERROR(_xlfn.CONFIDENCE.T('background calcs'!$Q$4,_xlfn.STDEV.S(D158:CY158),COUNT(D158:CY158)),\"N/A\")))))","v":""}]
[null,"",{"$f":"IF(B159=0,0,IF(B159=\"N/A\",\"N/A\",IF(B159=\"\",\"\",IF(_xlfn.STDEV.P(D159:CY159)=0,0,IFERROR(_xlfn.CONFIDENCE.T('background calcs'!$Q$4,_xlfn.STDEV.S(D159:CY159),COUNT(D159:CY159)),\"N/A\")))))","v":""}]
[null,"",{"$f":"IF(B160=0,0,IF(B160=\"N/A\",\"N/A\",IF(B160=\"\",\"\",IF(_xlfn.STDEV.P(D160:CY160)=0,0,IFERROR(_xlfn.CONFIDENCE.T('background calcs'!$Q$4,_xlfn.STDEV.S(D160:CY160),COUNT(D160:CY160)),\"N/A\")))))","v":""}]
[{"$f":"'Data entry template'!C165","v":"Notes:"},"N/A",{"$f":"IF(B161=0,0,IF(B161=\"N/A\",\"N/A\",IF(B161=\"\",\"\",IF(_xlfn.STDEV.P(D161:CY161)=0,0,IFERROR(_xlfn.CONFIDENCE.T('background calcs'!$Q$4,_xlfn.STDEV.S(D161:CY161),COUNT(D161:CY161)),\"N/A\")))))","v":"N/A"}]
[null,"",{"$f":"IF(B162=0,0,IF(B162=\"N/A\",\"N/A\",IF(B162=\"\",\"\",IF(_xlfn.STDEV.P(D162:CY162)=0,0,IFERROR(_xlfn.CONFIDENCE.T('background calcs'!$Q$4,_xlfn.STDEV.S(D162:CY162),COUNT(D162:CY162)),\"N/A\")))))","v":""}]
[{"$f":"'Data entry template'!C167","v":"4.9 A"},"N/A",{"$f":"IF(B163=0,0,IF(B163=\"N/A\",\"N/A\",IF(B163=\"\",\"\",IF(_xlfn.STDEV.P(D163:CY163)=0,0,IFERROR(_xlfn.CONFIDENCE.T('background calcs'!$Q$4,_xlfn.STDEV.S(D163:CY163),COUNT(D163:CY163)),\"N/A\")))))","v":"N/A"},""]
[null,"",{"$f":"IF(B164=0,0,IF(B164=\"N/A\",\"N/A\",IF(B164=\"\",\"\",IF(_xlfn.STDEV.P(D164:CY164)=0,0,IFERROR(_xlfn.CONFIDENCE.T('background calcs'!$Q$4,_xlfn.STDEV.S(D164:CY164),COUNT(D164:CY164)),\"N/A\")))))","v":""}]
[null,"",{"$f":"IF(B165=0,0,IF(B165=\"N/A\",\"N/A\",IF(B165=\"\",\"\",IF(_xlfn.STDEV.P(D165:CY165)=0,0,IFERROR(_xlfn.CONFIDENCE.T('background calcs'!$Q$4,_xlfn.STDEV.S(D165:CY165),COUNT(D165:CY165)),\"N/A\")))))","v":""}]
[null,"",{"$f":"IF(B166=0,0,IF(B166=\"N/A\",\"N/A\",IF(B166=\"\",\"\",IF(_xlfn.STDEV.P(D166:CY166)=0,0,IFERROR(_xlfn.CONFIDENCE.T('background calcs'!$Q$4,_xlfn.STDEV.S(D166:CY166),COUNT(D166:CY166)),\"N/A\")))))","v":""}]
[null,"",{"$f":"IF(B167=0,0,IF(B167=\"N/A\",\"N/A\",IF(B167=\"\",\"\",IF(_xlfn.STDEV.P(D167:CY167)=0,0,IFERROR(_xlfn.CONFIDENCE.T('background calcs'!$Q$4,_xlfn.STDEV.S(D167:CY167),COUNT(D167:CY167)),\"N/A\")))))","v":""}]
[null,"",{"$f":"IF(B168=0,0,IF(B168=\"N/A\",\"N/A\",IF(B168=\"\",\"\",IF(_xlfn.STDEV.P(D168:CY168)=0,0,IFERROR(_xlfn.CONFIDENCE.T('background calcs'!$Q$4,_xlfn.STDEV.S(D168:CY168),COUNT(D168:CY168)),\"N/A\")))))","v":""}]
[null,"",{"$f":"IF(B169=0,0,IF(B169=\"N/A\",\"N/A\",IF(B169=\"\",\"\",IF(_xlfn.STDEV.P(D169:CY169)=0,0,IFERROR(_xlfn.CONFIDENCE.T('background calcs'!$Q$4,_xlfn.STDEV.S(D169:CY169),COUNT(D169:CY169)),\"N/A\")))))","v":""}]
[null,"",{"$f":"IF(B170=0,0,IF(B170=\"N/A\",\"N/A\",IF(B170=\"\",\"\",IF(_xlfn.STDEV.P(D170:CY170)=0,0,IFERROR(_xlfn.CONFIDENCE.T('background calcs'!$Q$4,_xlfn.STDEV.S(D170:CY170),COUNT(D170:CY170)),\"N/A\")))))","v":""}]
[{"$f":"'Data entry template'!C175","v":"4.9 B"},"N/A",{"$f":"IF(B171=0,0,IF(B171=\"N/A\",\"N/A\",IF(B171=\"\",\"\",IF(_xlfn.STDEV.P(D171:CY171)=0,0,IFERROR(_xlfn.CONFIDENCE.T('background calcs'!$Q$4,_xlfn.STDEV.S(D171:CY171),COUNT(D171:CY171)),\"N/A\")))))","v":"N/A"},""]
[null,"",{"$f":"IF(B172=0,0,IF(B172=\"N/A\",\"N/A\",IF(B172=\"\",\"\",IF(_xlfn.STDEV.P(D172:CY172)=0,0,IFERROR(_xlfn.CONFIDENCE.T('background calcs'!$Q$4,_xlfn.STDEV.S(D172:CY172),COUNT(D172:CY172)),\"N/A\")))))","v":""}]
[null,"",{"$f":"IF(B173=0,0,IF(B173=\"N/A\",\"N/A\",IF(B173=\"\",\"\",IF(_xlfn.STDEV.P(D173:CY173)=0,0,IFERROR(_xlfn.CONFIDENCE.T('background calcs'!$Q$4,_xlfn.STDEV.S(D173:CY173),COUNT(D173:CY173)),\"N/A\")))))","v":""}]
[null,"",{"$f":"IF(B174=0,0,IF(B174=\"N/A\",\"N/A\",IF(B174=\"\",\"\",IF(_xlfn.STDEV.P(D174:CY174)=0,0,IFERROR(_xlfn.CONFIDENCE.T('background calcs'!$Q$4,_xlfn.STDEV.S(D174:CY174),COUNT(D174:CY174)),\"N/A\")))))","v":""}]
[null,"",{"$f":"IF(B175=0,0,IF(B175=\"N/A\",\"N/A\",IF(B175=\"\",\"\",IF(_xlfn.STDEV.P(D175:CY175)=0,0,IFERROR(_xlfn.CONFIDENCE.T('background calcs'!$Q$4,_xlfn.STDEV.S(D175:CY175),COUNT(D175:CY175)),\"N/A\")))))","v":""}]
[null,"",{"$f":"IF(B176=0,0,IF(B176=\"N/A\",\"N/A\",IF(B176=\"\",\"\",IF(_xlfn.STDEV.P(D176:CY176)=0,0,IFERROR(_xlfn.CONFIDENCE.T('background calcs'!$Q$4,_xlfn.STDEV.S(D176:CY176),COUNT(D176:CY176)),\"N/A\")))))","v":""}]
[null,"",{"$f":"IF(B177=0,0,IF(B177=\"N/A\",\"N/A\",IF(B177=\"\",\"\",IF(_xlfn.STDEV.P(D177:CY177)=0,0,IFERROR(_xlfn.CONFIDENCE.T('background calcs'!$Q$4,_xlfn.STDEV.S(D177:CY177),COUNT(D177:CY177)),\"N/A\")))))","v":""}]
[null,"",{"$f":"IF(B178=0,0,IF(B178=\"N/A\",\"N/A\",IF(B178=\"\",\"\",IF(_xlfn.STDEV.P(D178:CY178)=0,0,IFERROR(_xlfn.CONFIDENCE.T('background calcs'!$Q$4,_xlfn.STDEV.S(D178:CY178),COUNT(D178:CY178)),\"N/A\")))))","v":""}]
[{"$f":"'Data entry template'!C183","v":"Notes:"},"N/A",{"$f":"IF(B179=0,0,IF(B179=\"N/A\",\"N/A\",IF(B179=\"\",\"\",IF(_xlfn.STDEV.P(D179:CY179)=0,0,IFERROR(_xlfn.CONFIDENCE.T('background calcs'!$Q$4,_xlfn.STDEV.S(D179:CY179),COUNT(D179:CY179)),\"N/A\")))))","v":"N/A"}]
[null,"",{"$f":"IF(B180=0,0,IF(B180=\"N/A\",\"N/A\",IF(B180=\"\",\"\",IF(_xlfn.STDEV.P(D180:CY180)=0,0,IFERROR(_xlfn.CONFIDENCE.T('background calcs'!$Q$4,_xlfn.STDEV.S(D180:CY180),COUNT(D180:CY180)),\"N/A\")))))","v":""}]
[{"$f":"'Data entry template'!C185","v":"4.10 A"},"N/A",{"$f":"IF(B181=0,0,IF(B181=\"N/A\",\"N/A\",IF(B181=\"\",\"\",IF(_xlfn.STDEV.P(D181:CY181)=0,0,IFERROR(_xlfn.CONFIDENCE.T('background calcs'!$Q$4,_xlfn.STDEV.S(D181:CY181),COUNT(D181:CY181)),\"N/A\")))))","v":"N/A"},""]
[null,"",{"$f":"IF(B182=0,0,IF(B182=\"N/A\",\"N/A\",IF(B182=\"\",\"\",IF(_xlfn.STDEV.P(D182:CY182)=0,0,IFERROR(_xlfn.CONFIDENCE.T('background calcs'!$Q$4,_xlfn.STDEV.S(D182:CY182),COUNT(D182:CY182)),\"N/A\")))))","v":""}]
[null,"",{"$f":"IF(B183=0,0,IF(B183=\"N/A\",\"N/A\",IF(B183=\"\",\"\",IF(_xlfn.STDEV.P(D183:CY183)=0,0,IFERROR(_xlfn.CONFIDENCE.T('background calcs'!$Q$4,_xlfn.STDEV.S(D183:CY183),COUNT(D183:CY183)),\"N/A\")))))","v":""}]
[null,"",{"$f":"IF(B184=0,0,IF(B184=\"N/A\",\"N/A\",IF(B184=\"\",\"\",IF(_xlfn.STDEV.P(D184:CY184)=0,0,IFERROR(_xlfn.CONFIDENCE.T('background calcs'!$Q$4,_xlfn.STDEV.S(D184:CY184),COUNT(D184:CY184)),\"N/A\")))))","v":""}]
[null,"",{"$f":"IF(B185=0,0,IF(B185=\"N/A\",\"N/A\",IF(B185=\"\",\"\",IF(_xlfn.STDEV.P(D185:CY185)=0,0,IFERROR(_xlfn.CONFIDENCE.T('background calcs'!$Q$4,_xlfn.STDEV.S(D185:CY185),COUNT(D185:CY185)),\"N/A\")))))","v":""}]
[null,"",{"$f":"IF(B186=0,0,IF(B186=\"N/A\",\"N/A\",IF(B186=\"\",\"\",IF(_xlfn.STDEV.P(D186:CY186)=0,0,IFERROR(_xlfn.CONFIDENCE.T('background calcs'!$Q$4,_xlfn.STDEV.S(D186:CY186),COUNT(D186:CY186)),\"N/A\")))))","v":""}]
[null,"",{"$f":"IF(B187=0,0,IF(B187=\"N/A\",\"N/A\",IF(B187=\"\",\"\",IF(_xlfn.STDEV.P(D187:CY187)=0,0,IFERROR(_xlfn.CONFIDENCE.T('background calcs'!$Q$4,_xlfn.STDEV.S(D187:CY187),COUNT(D187:CY187)),\"N/A\")))))","v":""}]
[null,"",{"$f":"IF(B188=0,0,IF(B188=\"N/A\",\"N/A\",IF(B188=\"\",\"\",IF(_xlfn.STDEV.P(D188:CY188)=0,0,IFERROR(_xlfn.CONFIDENCE.T('background calcs'!$Q$4,_xlfn.STDEV.S(D188:CY188),COUNT(D188:CY188)),\"N/A\")))))","v":""}]
[{"$f":"'Data entry template'!C193","v":"4.10 B"},"N/A",{"$f":"IF(B189=0,0,IF(B189=\"N/A\",\"N/A\",IF(B189=\"\",\"\",IF(_xlfn.STDEV.P(D189:CY189)=0,0,IFERROR(_xlfn.CONFIDENCE.T('background calcs'!$Q$4,_xlfn.STDEV.S(D189:CY189),COUNT(D189:CY189)),\"N/A\")))))","v":"N/A"},""]
[null,"",{"$f":"IF(B190=0,0,IF(B190=\"N/A\",\"N/A\",IF(B190=\"\",\"\",IF(_xlfn.STDEV.P(D190:CY190)=0,0,IFERROR(_xlfn.CONFIDENCE.T('background calcs'!$Q$4,_xlfn.STDEV.S(D190:CY190),COUNT(D190:CY190)),\"N/A\")))))","v":""}]
[null,"",{"$f":"IF(B191=0,0,IF(B191=\"N/A\",\"N/A\",IF(B191=\"\",\"\",IF(_xlfn.STDEV.P(D191:CY191)=0,0,IFERROR(_xlfn.CONFIDENCE.T('background calcs'!$Q$4,_xlfn.STDEV.S(D191:CY191),COUNT(D191:CY191)),\"N/A\")))))","v":""}]
[null,"",{"$f":"IF(B192=0,0,IF(B192=\"N/A\",\"N/A\",IF(B192=\"\",\"\",IF(_xlfn.STDEV.P(D192:CY192)=0,0,IFERROR(_xlfn.CONFIDENCE.T('background calcs'!$Q$4,_xlfn.STDEV.S(D192:CY192),COUNT(D192:CY192)),\"N/A\")))))","v":""}]
[null,"",{"$f":"IF(B193=0,0,IF(B193=\"N/A\",\"N/A\",IF(B193=\"\",\"\",IF(_xlfn.STDEV.P(D193:CY193)=0,0,IFERROR(_xlfn.CONFIDENCE.T('background calcs'!$Q$4,_xlfn.STDEV.S(D193:CY193),COUNT(D193:CY193)),\"N/A\")))))","v":""}]
[null,"",{"$f":"IF(B194=0,0,IF(B194=\"N/A\",\"N/A\",IF(B194=\"\",\"\",IF(_xlfn.STDEV.P(D194:CY194)=0,0,IFERROR(_xlfn.CONFIDENCE.T('background calcs'!$Q$4,_xlfn.STDEV.S(D194:CY194),COUNT(D194:CY194)),\"N/A\")))))","v":""}]
[null,"",{"$f":"IF(B195=0,0,IF(B195=\"N/A\",\"N/A\",IF(B195=\"\",\"\",IF(_xlfn.STDEV.P(D195:CY195)=0,0,IFERROR(_xlfn.CONFIDENCE.T('background calcs'!$Q$4,_xlfn.STDEV.S(D195:CY195),COUNT(D195:CY195)),\"N/A\")))))","v":""}]
[null,"",{"$f":"IF(B196=0,0,IF(B196=\"N/A\",\"N/A\",IF(B196=\"\",\"\",IF(_xlfn.STDEV.P(D196:CY196)=0,0,IFERROR(_xlfn.CONFIDENCE.T('background calcs'!$Q$4,_xlfn.STDEV.S(D196:CY196),COUNT(D196:CY196)),\"N/A\")))))","v":""}]
[{"$f":"'Data entry template'!C201","v":"Notes:"},{"$f":"IF(ISBLANK(A197),\"\",IF(COUNTBLANK(D197:CY197)=100,\"N/A\",IFERROR(AVERAGE(D197:CY197),\"\")))","v":"N/A"},{"$f":"IF(B197=0,0,IF(B197=\"N/A\",\"N/A\",IF(B197=\"\",\"\",IF(_xlfn.STDEV.P(D197:CY197)=0,0,IFERROR(_xlfn.CONFIDENCE.T('background calcs'!$Q$4,_xlfn.STDEV.S(D197:CY197),COUNT(D197:CY197)),\"N/A\")))))","v":"N/A"}]
[null,"",{"$f":"IF(B198=0,0,IF(B198=\"N/A\",\"N/A\",IF(B198=\"\",\"\",IF(_xlfn.STDEV.P(D198:CY198)=0,0,IFERROR(_xlfn.CONFIDENCE.T('background calcs'!$Q$4,_xlfn.STDEV.S(D198:CY198),COUNT(D198:CY198)),\"N/A\")))))","v":""}]
[{"$f":"'Data entry template'!C203","v":"4.11 A"},"N/A",{"$f":"IF(B199=0,0,IF(B199=\"N/A\",\"N/A\",IF(B199=\"\",\"\",IF(_xlfn.STDEV.P(D199:CY199)=0,0,IFERROR(_xlfn.CONFIDENCE.T('background calcs'!$Q$4,_xlfn.STDEV.S(D199:CY199),COUNT(D199:CY199)),\"N/A\")))))","v":"N/A"},""]
[null,"",{"$f":"IF(B200=0,0,IF(B200=\"N/A\",\"N/A\",IF(B200=\"\",\"\",IF(_xlfn.STDEV.P(D200:CY200)=0,0,IFERROR(_xlfn.CONFIDENCE.T('background calcs'!$Q$4,_xlfn.STDEV.S(D200:CY200),COUNT(D200:CY200)),\"N/A\")))))","v":""}]
[null,"",{"$f":"IF(B201=0,0,IF(B201=\"N/A\",\"N/A\",IF(B201=\"\",\"\",IF(_xlfn.STDEV.P(D201:CY201)=0,0,IFERROR(_xlfn.CONFIDENCE.T('background calcs'!$Q$4,_xlfn.STDEV.S(D201:CY201),COUNT(D201:CY201)),\"N/A\")))))","v":""}]
[null,"",{"$f":"IF(B202=0,0,IF(B202=\"N/A\",\"N/A\",IF(B202=\"\",\"\",IF(_xlfn.STDEV.P(D202:CY202)=0,0,IFERROR(_xlfn.CONFIDENCE.T('background calcs'!$Q$4,_xlfn.STDEV.S(D202:CY202),COUNT(D202:CY202)),\"N/A\")))))","v":""}]
[null,"",{"$f":"IF(B203=0,0,IF(B203=\"N/A\",\"N/A\",IF(B203=\"\",\"\",IF(_xlfn.STDEV.P(D203:CY203)=0,0,IFERROR(_xlfn.CONFIDENCE.T('background calcs'!$Q$4,_xlfn.STDEV.S(D203:CY203),COUNT(D203:CY203)),\"N/A\")))))","v":""}]
[null,"",{"$f":"IF(B204=0,0,IF(B204=\"N/A\",\"N/A\",IF(B204=\"\",\"\",IF(_xlfn.STDEV.P(D204:CY204)=0,0,IFERROR(_xlfn.CONFIDENCE.T('background calcs'!$Q$4,_xlfn.STDEV.S(D204:CY204),COUNT(D204:CY204)),\"N/A\")))))","v":""}]
[null,"",{"$f":"IF(B205=0,0,IF(B205=\"N/A\",\"N/A\",IF(B205=\"\",\"\",IF(_xlfn.STDEV.P(D205:CY205)=0,0,IFERROR(_xlfn.CONFIDENCE.T('background calcs'!$Q$4,_xlfn.STDEV.S(D205:CY205),COUNT(D205:CY205)),\"N/A\")))))","v":""}]
[null,"",{"$f":"IF(B206=0,0,IF(B206=\"N/A\",\"N/A\",IF(B206=\"\",\"\",IF(_xlfn.STDEV.P(D206:CY206)=0,0,IFERROR(_xlfn.CONFIDENCE.T('background calcs'!$Q$4,_xlfn.STDEV.S(D206:CY206),COUNT(D206:CY206)),\"N/A\")))))","v":""}]
[{"$f":"'Data entry template'!C211","v":"4.11 B"},"N/A",{"$f":"IF(B207=0,0,IF(B207=\"N/A\",\"N/A\",IF(B207=\"\",\"\",IF(_xlfn.STDEV.P(D207:CY207)=0,0,IFERROR(_xlfn.CONFIDENCE.T('background calcs'!$Q$4,_xlfn.STDEV.S(D207:CY207),COUNT(D207:CY207)),\"N/A\")))))","v":"N/A"},""]
[null,"",{"$f":"IF(B208=0,0,IF(B208=\"N/A\",\"N/A\",IF(B208=\"\",\"\",IF(_xlfn.STDEV.P(D208:CY208)=0,0,IFERROR(_xlfn.CONFIDENCE.T('background calcs'!$Q$4,_xlfn.STDEV.S(D208:CY208),COUNT(D208:CY208)),\"N/A\")))))","v":""}]
[null,"",{"$f":"IF(B209=0,0,IF(B209=\"N/A\",\"N/A\",IF(B209=\"\",\"\",IF(_xlfn.STDEV.P(D209:CY209)=0,0,IFERROR(_xlfn.CONFIDENCE.T('background calcs'!$Q$4,_xlfn.STDEV.S(D209:CY209),COUNT(D209:CY209)),\"N/A\")))))","v":""}]
[null,"",{"$f":"IF(B210=0,0,IF(B210=\"N/A\",\"N/A\",IF(B210=\"\",\"\",IF(_xlfn.STDEV.P(D210:CY210)=0,0,IFERROR(_xlfn.CONFIDENCE.T('background calcs'!$Q$4,_xlfn.STDEV.S(D210:CY210),COUNT(D210:CY210)),\"N/A\")))))","v":""}]
[null,"",{"$f":"IF(B211=0,0,IF(B211=\"N/A\",\"N/A\",IF(B211=\"\",\"\",IF(_xlfn.STDEV.P(D211:CY211)=0,0,IFERROR(_xlfn.CONFIDENCE.T('background calcs'!$Q$4,_xlfn.STDEV.S(D211:CY211),COUNT(D211:CY211)),\"N/A\")))))","v":""}]
[null,"",{"$f":"IF(B212=0,0,IF(B212=\"N/A\",\"N/A\",IF(B212=\"\",\"\",IF(_xlfn.STDEV.P(D212:CY212)=0,0,IFERROR(_xlfn.CONFIDENCE.T('background calcs'!$Q$4,_xlfn.STDEV.S(D212:CY212),COUNT(D212:CY212)),\"N/A\")))))","v":""}]
[null,"",{"$f":"IF(B213=0,0,IF(B213=\"N/A\",\"N/A\",IF(B213=\"\",\"\",IF(_xlfn.STDEV.P(D213:CY213)=0,0,IFERROR(_xlfn.CONFIDENCE.T('background calcs'!$Q$4,_xlfn.STDEV.S(D213:CY213),COUNT(D213:CY213)),\"N/A\")))))","v":""}]
[null,"",{"$f":"IF(B214=0,0,IF(B214=\"N/A\",\"N/A\",IF(B214=\"\",\"\",IF(_xlfn.STDEV.P(D214:CY214)=0,0,IFERROR(_xlfn.CONFIDENCE.T('background calcs'!$Q$4,_xlfn.STDEV.S(D214:CY214),COUNT(D214:CY214)),\"N/A\")))))","v":""}]
[{"$f":"'Data entry template'!C219","v":"Notes:"},"N/A",{"$f":"IF(B215=0,0,IF(B215=\"N/A\",\"N/A\",IF(B215=\"\",\"\",IF(_xlfn.STDEV.P(D215:CY215)=0,0,IFERROR(_xlfn.CONFIDENCE.T('background calcs'!$Q$4,_xlfn.STDEV.S(D215:CY215),COUNT(D215:CY215)),\"N/A\")))))","v":"N/A"}]
[null,"",{"$f":"IF(B216=0,0,IF(B216=\"N/A\",\"N/A\",IF(B216=\"\",\"\",IF(_xlfn.STDEV.P(D216:CY216)=0,0,IFERROR(_xlfn.CONFIDENCE.T('background calcs'!$Q$4,_xlfn.STDEV.S(D216:CY216),COUNT(D216:CY216)),\"N/A\")))))","v":""}]
[{"$f":"'Data entry template'!C221","v":"4.12 A"},"N/A",{"$f":"IF(B217=0,0,IF(B217=\"N/A\",\"N/A\",IF(B217=\"\",\"\",IF(_xlfn.STDEV.P(D217:CY217)=0,0,IFERROR(_xlfn.CONFIDENCE.T('background calcs'!$Q$4,_xlfn.STDEV.S(D217:CY217),COUNT(D217:CY217)),\"N/A\")))))","v":"N/A"},""]
[null,"",{"$f":"IF(B218=0,0,IF(B218=\"N/A\",\"N/A\",IF(B218=\"\",\"\",IF(_xlfn.STDEV.P(D218:CY218)=0,0,IFERROR(_xlfn.CONFIDENCE.T('background calcs'!$Q$4,_xlfn.STDEV.S(D218:CY218),COUNT(D218:CY218)),\"N/A\")))))","v":""}]
[null,"",{"$f":"IF(B219=0,0,IF(B219=\"N/A\",\"N/A\",IF(B219=\"\",\"\",IF(_xlfn.STDEV.P(D219:CY219)=0,0,IFERROR(_xlfn.CONFIDENCE.T('background calcs'!$Q$4,_xlfn.STDEV.S(D219:CY219),COUNT(D219:CY219)),\"N/A\")))))","v":""}]
[null,"",{"$f":"IF(B220=0,0,IF(B220=\"N/A\",\"N/A\",IF(B220=\"\",\"\",IF(_xlfn.STDEV.P(D220:CY220)=0,0,IFERROR(_xlfn.CONFIDENCE.T('background calcs'!$Q$4,_xlfn.STDEV.S(D220:CY220),COUNT(D220:CY220)),\"N/A\")))))","v":""}]
[null,"",{"$f":"IF(B221=0,0,IF(B221=\"N/A\",\"N/A\",IF(B221=\"\",\"\",IF(_xlfn.STDEV.P(D221:CY221)=0,0,IFERROR(_xlfn.CONFIDENCE.T('background calcs'!$Q$4,_xlfn.STDEV.S(D221:CY221),COUNT(D221:CY221)),\"N/A\")))))","v":""}]
[null,"",{"$f":"IF(B222=0,0,IF(B222=\"N/A\",\"N/A\",IF(B222=\"\",\"\",IF(_xlfn.STDEV.P(D222:CY222)=0,0,IFERROR(_xlfn.CONFIDENCE.T('background calcs'!$Q$4,_xlfn.STDEV.S(D222:CY222),COUNT(D222:CY222)),\"N/A\")))))","v":""}]
[null,"",{"$f":"IF(B223=0,0,IF(B223=\"N/A\",\"N/A\",IF(B223=\"\",\"\",IF(_xlfn.STDEV.P(D223:CY223)=0,0,IFERROR(_xlfn.CONFIDENCE.T('background calcs'!$Q$4,_xlfn.STDEV.S(D223:CY223),COUNT(D223:CY223)),\"N/A\")))))","v":""}]
[null,"",{"$f":"IF(B224=0,0,IF(B224=\"N/A\",\"N/A\",IF(B224=\"\",\"\",IF(_xlfn.STDEV.P(D224:CY224)=0,0,IFERROR(_xlfn.CONFIDENCE.T('background calcs'!$Q$4,_xlfn.STDEV.S(D224:CY224),COUNT(D224:CY224)),\"N/A\")))))","v":""}]
[{"$f":"'Data entry template'!C229","v":"4.12 B"},"N/A",{"$f":"IF(B225=0,0,IF(B225=\"N/A\",\"N/A\",IF(B225=\"\",\"\",IF(_xlfn.STDEV.P(D225:CY225)=0,0,IFERROR(_xlfn.CONFIDENCE.T('background calcs'!$Q$4,_xlfn.STDEV.S(D225:CY225),COUNT(D225:CY225)),\"N/A\")))))","v":"N/A"},""]
[null,"",{"$f":"IF(B226=0,0,IF(B226=\"N/A\",\"N/A\",IF(B226=\"\",\"\",IF(_xlfn.STDEV.P(D226:CY226)=0,0,IFERROR(_xlfn.CONFIDENCE.T('background calcs'!$Q$4,_xlfn.STDEV.S(D226:CY226),COUNT(D226:CY226)),\"N/A\")))))","v":""}]
[null,"",{"$f":"IF(B227=0,0,IF(B227=\"N/A\",\"N/A\",IF(B227=\"\",\"\",IF(_xlfn.STDEV.P(D227:CY227)=0,0,IFERROR(_xlfn.CONFIDENCE.T('background calcs'!$Q$4,_xlfn.STDEV.S(D227:CY227),COUNT(D227:CY227)),\"N/A\")))))","v":""}]
[null,"",{"$f":"IF(B228=0,0,IF(B228=\"N/A\",\"N/A\",IF(B228=\"\",\"\",IF(_xlfn.STDEV.P(D228:CY228)=0,0,IFERROR(_xlfn.CONFIDENCE.T('background calcs'!$Q$4,_xlfn.STDEV.S(D228:CY228),COUNT(D228:CY228)),\"N/A\")))))","v":""}]
[null,"",{"$f":"IF(B229=0,0,IF(B229=\"N/A\",\"N/A\",IF(B229=\"\",\"\",IF(_xlfn.STDEV.P(D229:CY229)=0,0,IFERROR(_xlfn.CONFIDENCE.T('background calcs'!$Q$4,_xlfn.STDEV.S(D229:CY229),COUNT(D229:CY229)),\"N/A\")))))","v":""}]
[null,"",{"$f":"IF(B230=0,0,IF(B230=\"N/A\",\"N/A\",IF(B230=\"\",\"\",IF(_xlfn.STDEV.P(D230:CY230)=0,0,IFERROR(_xlfn.CONFIDENCE.T('background calcs'!$Q$4,_xlfn.STDEV.S(D230:CY230),COUNT(D230:CY230)),\"N/A\")))))","v":""}]
[null,"",{"$f":"IF(B231=0,0,IF(B231=\"N/A\",\"N/A\",IF(B231=\"\",\"\",IF(_xlfn.STDEV.P(D231:CY231)=0,0,IFERROR(_xlfn.CONFIDENCE.T('background calcs'!$Q$4,_xlfn.STDEV.S(D231:CY231),COUNT(D231:CY231)),\"N/A\")))))","v":""}]
[null,"",{"$f":"IF(B232=0,0,IF(B232=\"N/A\",\"N/A\",IF(B232=\"\",\"\",IF(_xlfn.STDEV.P(D232:CY232)=0,0,IFERROR(_xlfn.CONFIDENCE.T('background calcs'!$Q$4,_xlfn.STDEV.S(D232:CY232),COUNT(D232:CY232)),\"N/A\")))))","v":""}]
[{"$f":"'Data entry template'!C237","v":"Notes:"},"N/A",{"$f":"IF(B233=0,0,IF(B233=\"N/A\",\"N/A\",IF(B233=\"\",\"\",IF(_xlfn.STDEV.P(D233:CY233)=0,0,IFERROR(_xlfn.CONFIDENCE.T('background calcs'!$Q$4,_xlfn.STDEV.S(D233:CY233),COUNT(D233:CY233)),\"N/A\")))))","v":"N/A"}]
[null,"",{"$f":"IF(B234=0,0,IF(B234=\"N/A\",\"N/A\",IF(B234=\"\",\"\",IF(_xlfn.STDEV.P(D234:CY234)=0,0,IFERROR(_xlfn.CONFIDENCE.T('background calcs'!$Q$4,_xlfn.STDEV.S(D234:CY234),COUNT(D234:CY234)),\"N/A\")))))","v":""}]
[{"$f":"'Data entry template'!C239","v":4.13},"N/A",{"$f":"IF(B235=0,0,IF(B235=\"N/A\",\"N/A\",IF(B235=\"\",\"\",IF(_xlfn.STDEV.P(D235:CY235)=0,0,IFERROR(_xlfn.CONFIDENCE.T('background calcs'!$Q$4,_xlfn.STDEV.S(D235:CY235),COUNT(D235:CY235)),\"N/A\")))))","v":"N/A"}]
[null,"",{"$f":"IF(B236=0,0,IF(B236=\"N/A\",\"N/A\",IF(B236=\"\",\"\",IF(_xlfn.STDEV.P(D236:CY236)=0,0,IFERROR(_xlfn.CONFIDENCE.T('background calcs'!$Q$4,_xlfn.STDEV.S(D236:CY236),COUNT(D236:CY236)),\"N/A\")))))","v":""}]
[null,"",{"$f":"IF(B237=0,0,IF(B237=\"N/A\",\"N/A\",IF(B237=\"\",\"\",IF(_xlfn.STDEV.P(D237:CY237)=0,0,IFERROR(_xlfn.CONFIDENCE.T('background calcs'!$Q$4,_xlfn.STDEV.S(D237:CY237),COUNT(D237:CY237)),\"N/A\")))))","v":""}]
[{"$f":"'Data entry template'!C242","v":"Notes:"},"N/A",{"$f":"IF(B238=0,0,IF(B238=\"N/A\",\"N/A\",IF(B238=\"\",\"\",IF(_xlfn.STDEV.P(D238:CY238)=0,0,IFERROR(_xlfn.CONFIDENCE.T('background calcs'!$Q$4,_xlfn.STDEV.S(D238:CY238),COUNT(D238:CY238)),\"N/A\")))))","v":"N/A"}]
[null,"",{"$f":"IF(B239=0,0,IF(B239=\"N/A\",\"N/A\",IF(B239=\"\",\"\",IF(_xlfn.STDEV.P(D239:CY239)=0,0,IFERROR(_xlfn.CONFIDENCE.T('background calcs'!$Q$4,_xlfn.STDEV.S(D239:CY239),COUNT(D239:CY239)),\"N/A\")))))","v":""}]
[{"$f":"'Data entry template'!C244","v":"4.14 A"},"N/A",{"$f":"IF(B240=0,0,IF(B240=\"N/A\",\"N/A\",IF(B240=\"\",\"\",IF(_xlfn.STDEV.P(D240:CY240)=0,0,IFERROR(_xlfn.CONFIDENCE.T('background calcs'!$Q$4,_xlfn.STDEV.S(D240:CY240),COUNT(D240:CY240)),\"N/A\")))))","v":"N/A"},""]
[null,"",{"$f":"IF(B241=0,0,IF(B241=\"N/A\",\"N/A\",IF(B241=\"\",\"\",IF(_xlfn.STDEV.P(D241:CY241)=0,0,IFERROR(_xlfn.CONFIDENCE.T('background calcs'!$Q$4,_xlfn.STDEV.S(D241:CY241),COUNT(D241:CY241)),\"N/A\")))))","v":""}]
[null,"",{"$f":"IF(B242=0,0,IF(B242=\"N/A\",\"N/A\",IF(B242=\"\",\"\",IF(_xlfn.STDEV.P(D242:CY242)=0,0,IFERROR(_xlfn.CONFIDENCE.T('background calcs'!$Q$4,_xlfn.STDEV.S(D242:CY242),COUNT(D242:CY242)),\"N/A\")))))","v":""}]
[null,"",{"$f":"IF(B243=0,0,IF(B243=\"N/A\",\"N/A\",IF(B243=\"\",\"\",IF(_xlfn.STDEV.P(D243:CY243)=0,0,IFERROR(_xlfn.CONFIDENCE.T('background calcs'!$Q$4,_xlfn.STDEV.S(D243:CY243),COUNT(D243:CY243)),\"N/A\")))))","v":""}]
[null,"",{"$f":"IF(B244=0,0,IF(B244=\"N/A\",\"N/A\",IF(B244=\"\",\"\",IF(_xlfn.STDEV.P(D244:CY244)=0,0,IFERROR(_xlfn.CONFIDENCE.T('background calcs'!$Q$4,_xlfn.STDEV.S(D244:CY244),COUNT(D244:CY244)),\"N/A\")))))","v":""}]
[null,"",{"$f":"IF(B245=0,0,IF(B245=\"N/A\",\"N/A\",IF(B245=\"\",\"\",IF(_xlfn.STDEV.P(D245:CY245)=0,0,IFERROR(_xlfn.CONFIDENCE.T('background calcs'!$Q$4,_xlfn.STDEV.S(D245:CY245),COUNT(D245:CY245)),\"N/A\")))))","v":""}]
[{"$f":"'Data entry template'!C250","v":"4.14 B"},"N/A",{"$f":"IF(B246=0,0,IF(B246=\"N/A\",\"N/A\",IF(B246=\"\",\"\",IF(_xlfn.STDEV.P(D246:CY246)=0,0,IFERROR(_xlfn.CONFIDENCE.T('background calcs'!$Q$4,_xlfn.STDEV.S(D246:CY246),COUNT(D246:CY246)),\"N/A\")))))","v":"N/A"},""]
[null,"",{"$f":"IF(B247=0,0,IF(B247=\"N/A\",\"N/A\",IF(B247=\"\",\"\",IF(_xlfn.STDEV.P(D247:CY247)=0,0,IFERROR(_xlfn.CONFIDENCE.T('background calcs'!$Q$4,_xlfn.STDEV.S(D247:CY247),COUNT(D247:CY247)),\"N/A\")))))","v":""}]
[null,"",{"$f":"IF(B248=0,0,IF(B248=\"N/A\",\"N/A\",IF(B248=\"\",\"\",IF(_xlfn.STDEV.P(D248:CY248)=0,0,IFERROR(_xlfn.CONFIDENCE.T('background calcs'!$Q$4,_xlfn.STDEV.S(D248:CY248),COUNT(D248:CY248)),\"N/A\")))))","v":""}]
[null,"",{"$f":"IF(B249=0,0,IF(B249=\"N/A\",\"N/A\",IF(B249=\"\",\"\",IF(_xlfn.STDEV.P(D249:CY249)=0,0,IFERROR(_xlfn.CONFIDENCE.T('background calcs'!$Q$4,_xlfn.STDEV.S(D249:CY249),COUNT(D249:CY249)),\"N/A\")))))","v":""}]
[null,"",{"$f":"IF(B250=0,0,IF(B250=\"N/A\",\"N/A\",IF(B250=\"\",\"\",IF(_xlfn.STDEV.P(D250:CY250)=0,0,IFERROR(_xlfn.CONFIDENCE.T('background calcs'!$Q$4,_xlfn.STDEV.S(D250:CY250),COUNT(D250:CY250)),\"N/A\")))))","v":""}]
[null,"",{"$f":"IF(B251=0,0,IF(B251=\"N/A\",\"N/A\",IF(B251=\"\",\"\",IF(_xlfn.STDEV.P(D251:CY251)=0,0,IFERROR(_xlfn.CONFIDENCE.T('background calcs'!$Q$4,_xlfn.STDEV.S(D251:CY251),COUNT(D251:CY251)),\"N/A\")))))","v":""}]
[null,"",{"$f":"IF(B252=0,0,IF(B252=\"N/A\",\"N/A\",IF(B252=\"\",\"\",IF(_xlfn.STDEV.P(D252:CY252)=0,0,IFERROR(_xlfn.CONFIDENCE.T('background calcs'!$Q$4,_xlfn.STDEV.S(D252:CY252),COUNT(D252:CY252)),\"N/A\")))))","v":""}]
[null,"",{"$f":"IF(B253=0,0,IF(B253=\"N/A\",\"N/A\",IF(B253=\"\",\"\",IF(_xlfn.STDEV.P(D253:CY253)=0,0,IFERROR(_xlfn.CONFIDENCE.T('background calcs'!$Q$4,_xlfn.STDEV.S(D253:CY253),COUNT(D253:CY253)),\"N/A\")))))","v":""}]
[{"$f":"'Data entry template'!C258","v":"Notes:"},"N/A",{"$f":"IF(B254=0,0,IF(B254=\"N/A\",\"N/A\",IF(B254=\"\",\"\",IF(_xlfn.STDEV.P(D254:CY254)=0,0,IFERROR(_xlfn.CONFIDENCE.T('background calcs'!$Q$4,_xlfn.STDEV.S(D254:CY254),COUNT(D254:CY254)),\"N/A\")))))","v":"N/A"}]
[null,"",{"$f":"IF(B255=0,0,IF(B255=\"N/A\",\"N/A\",IF(B255=\"\",\"\",IF(_xlfn.STDEV.P(D255:CY255)=0,0,IFERROR(_xlfn.CONFIDENCE.T('background calcs'!$Q$4,_xlfn.STDEV.S(D255:CY255),COUNT(D255:CY255)),\"N/A\")))))","v":""}]
[{"$f":"'Data entry template'!C260","v":"4.15 A"},"N/A",{"$f":"IF(B256=0,0,IF(B256=\"N/A\",\"N/A\",IF(B256=\"\",\"\",IF(_xlfn.STDEV.P(D256:CY256)=0,0,IFERROR(_xlfn.CONFIDENCE.T('background calcs'!$Q$4,_xlfn.STDEV.S(D256:CY256),COUNT(D256:CY256)),\"N/A\")))))","v":"N/A"}]
[null,"",{"$f":"IF(B257=0,0,IF(B257=\"N/A\",\"N/A\",IF(B257=\"\",\"\",IF(_xlfn.STDEV.P(D257:CY257)=0,0,IFERROR(_xlfn.CONFIDENCE.T('background calcs'!$Q$4,_xlfn.STDEV.S(D257:CY257),COUNT(D257:CY257)),\"N/A\")))))","v":""}]
[null,"",{"$f":"IF(B258=0,0,IF(B258=\"N/A\",\"N/A\",IF(B258=\"\",\"\",IF(_xlfn.STDEV.P(D258:CY258)=0,0,IFERROR(_xlfn.CONFIDENCE.T('background calcs'!$Q$4,_xlfn.STDEV.S(D258:CY258),COUNT(D258:CY258)),\"N/A\")))))","v":""}]
[{"$f":"'Data entry template'!C263","v":"4.15 B"},"N/A",{"$f":"IF(B259=0,0,IF(B259=\"N/A\",\"N/A\",IF(B259=\"\",\"\",IF(_xlfn.STDEV.P(D259:CY259)=0,0,IFERROR(_xlfn.CONFIDENCE.T('background calcs'!$Q$4,_xlfn.STDEV.S(D259:CY259),COUNT(D259:CY259)),\"N/A\")))))","v":"N/A"},""]
[null,"",{"$f":"IF(B260=0,0,IF(B260=\"N/A\",\"N/A\",IF(B260=\"\",\"\",IF(_xlfn.STDEV.P(D260:CY260)=0,0,IFERROR(_xlfn.CONFIDENCE.T('background calcs'!$Q$4,_xlfn.STDEV.S(D260:CY260),COUNT(D260:CY260)),\"N/A\")))))","v":""}]
[null,{"$f":"IF(ISBLANK(A261),\"\",IF(COUNTBLANK(D261:CY261)=100,\"N/A\",IFERROR(AVERAGE(D261:CY261),\"\")))","v":""},{"$f":"IF(B261=0,0,IF(B261=\"N/A\",\"N/A\",IF(B261=\"\",\"\",IF(_xlfn.STDEV.P(D261:CY261)=0,0,IFERROR(_xlfn.CONFIDENCE.T('background calcs'!$Q$4,_xlfn.STDEV.S(D261:CY261),COUNT(D261:CY261)),\"N/A\")))))","v":""}]
[null,"",{"$f":"IF(B262=0,0,IF(B262=\"N/A\",\"N/A\",IF(B262=\"\",\"\",IF(_xlfn.STDEV.P(D262:CY262)=0,0,IFERROR(_xlfn.CONFIDENCE.T('background calcs'!$Q$4,_xlfn.STDEV.S(D262:CY262),COUNT(D262:CY262)),\"N/A\")))))","v":""}]
[null,"",{"$f":"IF(B263=0,0,IF(B263=\"N/A\",\"N/A\",IF(B263=\"\",\"\",IF(_xlfn.STDEV.P(D263:CY263)=0,0,IFERROR(_xlfn.CONFIDENCE.T('background calcs'!$Q$4,_xlfn.STDEV.S(D263:CY263),COUNT(D263:CY263)),\"N/A\")))))","v":""}]
[null,"",{"$f":"IF(B264=0,0,IF(B264=\"N/A\",\"N/A\",IF(B264=\"\",\"\",IF(_xlfn.STDEV.P(D264:CY264)=0,0,IFERROR(_xlfn.CONFIDENCE.T('background calcs'!$Q$4,_xlfn.STDEV.S(D264:CY264),COUNT(D264:CY264)),\"N/A\")))))","v":""}]
[null,"",{"$f":"IF(B265=0,0,IF(B265=\"N/A\",\"N/A\",IF(B265=\"\",\"\",IF(_xlfn.STDEV.P(D265:CY265)=0,0,IFERROR(_xlfn.CONFIDENCE.T('background calcs'!$Q$4,_xlfn.STDEV.S(D265:CY265),COUNT(D265:CY265)),\"N/A\")))))","v":""}]
[null,"",{"$f":"IF(B266=0,0,IF(B266=\"N/A\",\"N/A\",IF(B266=\"\",\"\",IF(_xlfn.STDEV.P(D266:CY266)=0,0,IFERROR(_xlfn.CONFIDENCE.T('background calcs'!$Q$4,_xlfn.STDEV.S(D266:CY266),COUNT(D266:CY266)),\"N/A\")))))","v":""}]
[{"$f":"'Data entry template'!C271","v":"Notes:"},"N/A",{"$f":"IF(B267=0,0,IF(B267=\"N/A\",\"N/A\",IF(B267=\"\",\"\",IF(_xlfn.STDEV.P(D267:CY267)=0,0,IFERROR(_xlfn.CONFIDENCE.T('background calcs'!$Q$4,_xlfn.STDEV.S(D267:CY267),COUNT(D267:CY267)),\"N/A\")))))","v":"N/A"}]
[null,"",{"$f":"IF(B268=0,0,IF(B268=\"N/A\",\"N/A\",IF(B268=\"\",\"\",IF(_xlfn.STDEV.P(D268:CY268)=0,0,IFERROR(_xlfn.CONFIDENCE.T('background calcs'!$Q$4,_xlfn.STDEV.S(D268:CY268),COUNT(D268:CY268)),\"N/A\")))))","v":""}]
[{"$f":"'Data entry template'!C273","v":"4.16 A"},"N/A",{"$f":"IF(B269=0,0,IF(B269=\"N/A\",\"N/A\",IF(B269=\"\",\"\",IF(_xlfn.STDEV.P(D269:CY269)=0,0,IFERROR(_xlfn.CONFIDENCE.T('background calcs'!$Q$4,_xlfn.STDEV.S(D269:CY269),COUNT(D269:CY269)),\"N/A\")))))","v":"N/A"}]
["4.16 3sf","N/A",{"$f":"IF(B270=0,0,IF(B270=\"N/A\",\"N/A\",IF(B270=\"\",\"\",IF(_xlfn.STDEV.P(D270:CY270)=0,0,IFERROR(_xlfn.CONFIDENCE.T('background calcs'!$Q$4,_xlfn.STDEV.S(D270:CY270),COUNT(D270:CY270)),\"N/A\")))))","v":"N/A"}]
[null,"",{"$f":"IF(B271=0,0,IF(B271=\"N/A\",\"N/A\",IF(B271=\"\",\"\",IF(_xlfn.STDEV.P(D271:CY271)=0,0,IFERROR(_xlfn.CONFIDENCE.T('background calcs'!$Q$4,_xlfn.STDEV.S(D271:CY271),COUNT(D271:CY271)),\"N/A\")))))","v":""}]
[{"$f":"'Data entry template'!C276","v":"4.16 B"},"N/A",{"$f":"IF(B272=0,0,IF(B272=\"N/A\",\"N/A\",IF(B272=\"\",\"\",IF(_xlfn.STDEV.P(D272:CY272)=0,0,IFERROR(_xlfn.CONFIDENCE.T('background calcs'!$Q$4,_xlfn.STDEV.S(D272:CY272),COUNT(D272:CY272)),\"N/A\")))))","v":"N/A"},""]
[null,"",{"$f":"IF(B273=0,0,IF(B273=\"N/A\",\"N/A\",IF(B273=\"\",\"\",IF(_xlfn.STDEV.P(D273:CY273)=0,0,IFERROR(_xlfn.CONFIDENCE.T('background calcs'!$Q$4,_xlfn.STDEV.S(D273:CY273),COUNT(D273:CY273)),\"N/A\")))))","v":""}]
[null,"",{"$f":"IF(B274=0,0,IF(B274=\"N/A\",\"N/A\",IF(B274=\"\",\"\",IF(_xlfn.STDEV.P(D274:CY274)=0,0,IFERROR(_xlfn.CONFIDENCE.T('background calcs'!$Q$4,_xlfn.STDEV.S(D274:CY274),COUNT(D274:CY274)),\"N/A\")))))","v":""}]
[null,"",{"$f":"IF(B275=0,0,IF(B275=\"N/A\",\"N/A\",IF(B275=\"\",\"\",IF(_xlfn.STDEV.P(D275:CY275)=0,0,IFERROR(_xlfn.CONFIDENCE.T('background calcs'!$Q$4,_xlfn.STDEV.S(D275:CY275),COUNT(D275:CY275)),\"N/A\")))))","v":""}]
[null,"",{"$f":"IF(B276=0,0,IF(B276=\"N/A\",\"N/A\",IF(B276=\"\",\"\",IF(_xlfn.STDEV.P(D276:CY276)=0,0,IFERROR(_xlfn.CONFIDENCE.T('background calcs'!$Q$4,_xlfn.STDEV.S(D276:CY276),COUNT(D276:CY276)),\"N/A\")))))","v":""}]
[null,"",{"$f":"IF(B277=0,0,IF(B277=\"N/A\",\"N/A\",IF(B277=\"\",\"\",IF(_xlfn.STDEV.P(D277:CY277)=0,0,IFERROR(_xlfn.CONFIDENCE.T('background calcs'!$Q$4,_xlfn.STDEV.S(D277:CY277),COUNT(D277:CY277)),\"N/A\")))))","v":""}]
[null,"",{"$f":"IF(B278=0,0,IF(B278=\"N/A\",\"N/A\",IF(B278=\"\",\"\",IF(_xlfn.STDEV.P(D278:CY278)=0,0,IFERROR(_xlfn.CONFIDENCE.T('background calcs'!$Q$4,_xlfn.STDEV.S(D278:CY278),COUNT(D278:CY278)),\"N/A\")))))","v":""}]
[null,"",{"$f":"IF(B279=0,0,IF(B279=\"N/A\",\"N/A\",IF(B279=\"\",\"\",IF(_xlfn.STDEV.P(D279:CY279)=0,0,IFERROR(_xlfn.CONFIDENCE.T('background calcs'!$Q$4,_xlfn.STDEV.S(D279:CY279),COUNT(D279:CY279)),\"N/A\")))))","v":""}]
[{"$f":"'Data entry template'!C284","v":"Notes:"},"N/A",{"$f":"IF(B280=0,0,IF(B280=\"N/A\",\"N/A\",IF(B280=\"\",\"\",IF(_xlfn.STDEV.P(D280:CY280)=0,0,IFERROR(_xlfn.CONFIDENCE.T('background calcs'!$Q$4,_xlfn.STDEV.S(D280:CY280),COUNT(D280:CY280)),\"N/A\")))))","v":"N/A"}]
[null,"",{"$f":"IF(B281=0,0,IF(B281=\"N/A\",\"N/A\",IF(B281=\"\",\"\",IF(_xlfn.STDEV.P(D281:CY281)=0,0,IFERROR(_xlfn.CONFIDENCE.T('background calcs'!$Q$4,_xlfn.STDEV.S(D281:CY281),COUNT(D281:CY281)),\"N/A\")))))","v":""}]
[{"$f":"'Data entry template'!C286","v":"4.17 A"},"N/A",{"$f":"IF(B282=0,0,IF(B282=\"N/A\",\"N/A\",IF(B282=\"\",\"\",IF(_xlfn.STDEV.P(D282:CY282)=0,0,IFERROR(_xlfn.CONFIDENCE.T('background calcs'!$Q$4,_xlfn.STDEV.S(D282:CY282),COUNT(D282:CY282)),\"N/A\")))))","v":"N/A"},""]
[null,"",{"$f":"IF(B283=0,0,IF(B283=\"N/A\",\"N/A\",IF(B283=\"\",\"\",IF(_xlfn.STDEV.P(D283:CY283)=0,0,IFERROR(_xlfn.CONFIDENCE.T('background calcs'!$Q$4,_xlfn.STDEV.S(D283:CY283),COUNT(D283:CY283)),\"N/A\")))))","v":""}]
[null,"",{"$f":"IF(B284=0,0,IF(B284=\"N/A\",\"N/A\",IF(B284=\"\",\"\",IF(_xlfn.STDEV.P(D284:CY284)=0,0,IFERROR(_xlfn.CONFIDENCE.T('background calcs'!$Q$4,_xlfn.STDEV.S(D284:CY284),COUNT(D284:CY284)),\"N/A\")))))","v":""}]
[null,"",{"$f":"IF(B285=0,0,IF(B285=\"N/A\",\"N/A\",IF(B285=\"\",\"\",IF(_xlfn.STDEV.P(D285:CY285)=0,0,IFERROR(_xlfn.CONFIDENCE.T('background calcs'!$Q$4,_xlfn.STDEV.S(D285:CY285),COUNT(D285:CY285)),\"N/A\")))))","v":""}]
[null,"",{"$f":"IF(B286=0,0,IF(B286=\"N/A\",\"N/A\",IF(B286=\"\",\"\",IF(_xlfn.STDEV.P(D286:CY286)=0,0,IFERROR(_xlfn.CONFIDENCE.T('background calcs'!$Q$4,_xlfn.STDEV.S(D286:CY286),COUNT(D286:CY286)),\"N/A\")))))","v":""},"If parts are required, how much do they cost per year?"]
[{"$f":"A282&\"b\"","v":"4.17 Ab"},{"$f":"D287","v":0}]
[{"$f":"A282&\"c\"","v":"4.17 Ac"},{"$f":"IF(ISBLANK(A288),\"\",IF(COUNTBLANK(D288:CY288)=100,\"N/A\",IFERROR(AVERAGE(D288:CY288),\"\")))","v":"N/A"},{"$f":"IF(B288=0,0,IF(B288=\"N/A\",\"N/A\",IF(B288=\"\",\"\",IF(_xlfn.STDEV.P(D288:CY288)=0,0,IFERROR(_xlfn.CONFIDENCE.T('background calcs'!$Q$4,_xlfn.STDEV.S(D288:CY288),COUNT(D288:CY288)),\"N/A\")))))","v":"N/A"}]
[null,"",{"$f":"IF(B289=0,0,IF(B289=\"N/A\",\"N/A\",IF(B289=\"\",\"\",IF(_xlfn.STDEV.P(D289:CY289)=0,0,IFERROR(_xlfn.CONFIDENCE.T('background calcs'!$Q$4,_xlfn.STDEV.S(D289:CY289),COUNT(D289:CY289)),\"N/A\")))))","v":""}]
[null,"",{"$f":"IF(B290=0,0,IF(B290=\"N/A\",\"N/A\",IF(B290=\"\",\"\",IF(_xlfn.STDEV.P(D290:CY290)=0,0,IFERROR(_xlfn.CONFIDENCE.T('background calcs'!$Q$4,_xlfn.STDEV.S(D290:CY290),COUNT(D290:CY290)),\"N/A\")))))","v":""}]
[{"$f":"'Data entry template'!C295","v":"4.17 B"},"N/A",{"$f":"IF(B291=0,0,IF(B291=\"N/A\",\"N/A\",IF(B291=\"\",\"\",IF(_xlfn.STDEV.P(D291:CY291)=0,0,IFERROR(_xlfn.CONFIDENCE.T('background calcs'!$Q$4,_xlfn.STDEV.S(D291:CY291),COUNT(D291:CY291)),\"N/A\")))))","v":"N/A"},""]
[null,"",{"$f":"IF(B292=0,0,IF(B292=\"N/A\",\"N/A\",IF(B292=\"\",\"\",IF(_xlfn.STDEV.P(D292:CY292)=0,0,IFERROR(_xlfn.CONFIDENCE.T('background calcs'!$Q$4,_xlfn.STDEV.S(D292:CY292),COUNT(D292:CY292)),\"N/A\")))))","v":""}]
[null,"",{"$f":"IF(B293=0,0,IF(B293=\"N/A\",\"N/A\",IF(B293=\"\",\"\",IF(_xlfn.STDEV.P(D293:CY293)=0,0,IFERROR(_xlfn.CONFIDENCE.T('background calcs'!$Q$4,_xlfn.STDEV.S(D293:CY293),COUNT(D293:CY293)),\"N/A\")))))","v":""}]
[null,"",{"$f":"IF(B294=0,0,IF(B294=\"N/A\",\"N/A\",IF(B294=\"\",\"\",IF(_xlfn.STDEV.P(D294:CY294)=0,0,IFERROR(_xlfn.CONFIDENCE.T('background calcs'!$Q$4,_xlfn.STDEV.S(D294:CY294),COUNT(D294:CY294)),\"N/A\")))))","v":""}]
[null,"",{"$f":"IF(B295=0,0,IF(B295=\"N/A\",\"N/A\",IF(B295=\"\",\"\",IF(_xlfn.STDEV.P(D295:CY295)=0,0,IFERROR(_xlfn.CONFIDENCE.T('background calcs'!$Q$4,_xlfn.STDEV.S(D295:CY295),COUNT(D295:CY295)),\"N/A\")))))","v":""}]
[null,"",{"$f":"IF(B296=0,0,IF(B296=\"N/A\",\"N/A\",IF(B296=\"\",\"\",IF(_xlfn.STDEV.P(D296:CY296)=0,0,IFERROR(_xlfn.CONFIDENCE.T('background calcs'!$Q$4,_xlfn.STDEV.S(D296:CY296),COUNT(D296:CY296)),\"N/A\")))))","v":""}]
[null,"",{"$f":"IF(B297=0,0,IF(B297=\"N/A\",\"N/A\",IF(B297=\"\",\"\",IF(_xlfn.STDEV.P(D297:CY297)=0,0,IFERROR(_xlfn.CONFIDENCE.T('background calcs'!$Q$4,_xlfn.STDEV.S(D297:CY297),COUNT(D297:CY297)),\"N/A\")))))","v":""}]
[null,"",{"$f":"IF(B298=0,0,IF(B298=\"N/A\",\"N/A\",IF(B298=\"\",\"\",IF(_xlfn.STDEV.P(D298:CY298)=0,0,IFERROR(_xlfn.CONFIDENCE.T('background calcs'!$Q$4,_xlfn.STDEV.S(D298:CY298),COUNT(D298:CY298)),\"N/A\")))))","v":""}]
[{"$f":"'Data entry template'!C303","v":"Notes:"},"N/A",{"$f":"IF(B299=0,0,IF(B299=\"N/A\",\"N/A\",IF(B299=\"\",\"\",IF(_xlfn.STDEV.P(D299:CY299)=0,0,IFERROR(_xlfn.CONFIDENCE.T('background calcs'!$Q$4,_xlfn.STDEV.S(D299:CY299),COUNT(D299:CY299)),\"N/A\")))))","v":"N/A"}]
[null,"",{"$f":"IF(B300=0,0,IF(B300=\"N/A\",\"N/A\",IF(B300=\"\",\"\",IF(_xlfn.STDEV.P(D300:CY300)=0,0,IFERROR(_xlfn.CONFIDENCE.T('background calcs'!$Q$4,_xlfn.STDEV.S(D300:CY300),COUNT(D300:CY300)),\"N/A\")))))","v":""}]
[{"$f":"'Data entry template'!C305","v":"4.18 A"},"N/A",{"$f":"IF(B301=0,0,IF(B301=\"N/A\",\"N/A\",IF(B301=\"\",\"\",IF(_xlfn.STDEV.P(D301:CY301)=0,0,IFERROR(_xlfn.CONFIDENCE.T('background calcs'!$Q$4,_xlfn.STDEV.S(D301:CY301),COUNT(D301:CY301)),\"N/A\")))))","v":"N/A"},""]
[null,"",{"$f":"IF(B302=0,0,IF(B302=\"N/A\",\"N/A\",IF(B302=\"\",\"\",IF(_xlfn.STDEV.P(D302:CY302)=0,0,IFERROR(_xlfn.CONFIDENCE.T('background calcs'!$Q$4,_xlfn.STDEV.S(D302:CY302),COUNT(D302:CY302)),\"N/A\")))))","v":""}]
[null,"",{"$f":"IF(B303=0,0,IF(B303=\"N/A\",\"N/A\",IF(B303=\"\",\"\",IF(_xlfn.STDEV.P(D303:CY303)=0,0,IFERROR(_xlfn.CONFIDENCE.T('background calcs'!$Q$4,_xlfn.STDEV.S(D303:CY303),COUNT(D303:CY303)),\"N/A\")))))","v":""}]
[null,"",{"$f":"IF(B304=0,0,IF(B304=\"N/A\",\"N/A\",IF(B304=\"\",\"\",IF(_xlfn.STDEV.P(D304:CY304)=0,0,IFERROR(_xlfn.CONFIDENCE.T('background calcs'!$Q$4,_xlfn.STDEV.S(D304:CY304),COUNT(D304:CY304)),\"N/A\")))))","v":""}]
[null,"",{"$f":"IF(B305=0,0,IF(B305=\"N/A\",\"N/A\",IF(B305=\"\",\"\",IF(_xlfn.STDEV.P(D305:CY305)=0,0,IFERROR(_xlfn.CONFIDENCE.T('background calcs'!$Q$4,_xlfn.STDEV.S(D305:CY305),COUNT(D305:CY305)),\"N/A\")))))","v":""}]
[null,"",{"$f":"IF(B306=0,0,IF(B306=\"N/A\",\"N/A\",IF(B306=\"\",\"\",IF(_xlfn.STDEV.P(D306:CY306)=0,0,IFERROR(_xlfn.CONFIDENCE.T('background calcs'!$Q$4,_xlfn.STDEV.S(D306:CY306),COUNT(D306:CY306)),\"N/A\")))))","v":""}]
[null,"",{"$f":"IF(B307=0,0,IF(B307=\"N/A\",\"N/A\",IF(B307=\"\",\"\",IF(_xlfn.STDEV.P(D307:CY307)=0,0,IFERROR(_xlfn.CONFIDENCE.T('background calcs'!$Q$4,_xlfn.STDEV.S(D307:CY307),COUNT(D307:CY307)),\"N/A\")))))","v":""}]
[null,"",{"$f":"IF(B308=0,0,IF(B308=\"N/A\",\"N/A\",IF(B308=\"\",\"\",IF(_xlfn.STDEV.P(D308:CY308)=0,0,IFERROR(_xlfn.CONFIDENCE.T('background calcs'!$Q$4,_xlfn.STDEV.S(D308:CY308),COUNT(D308:CY308)),\"N/A\")))))","v":""}]
[{"$f":"'Data entry template'!C313","v":"4.18 B"},"N/A",{"$f":"IF(B309=0,0,IF(B309=\"N/A\",\"N/A\",IF(B309=\"\",\"\",IF(_xlfn.STDEV.P(D309:CY309)=0,0,IFERROR(_xlfn.CONFIDENCE.T('background calcs'!$Q$4,_xlfn.STDEV.S(D309:CY309),COUNT(D309:CY309)),\"N/A\")))))","v":"N/A"},""]
[null,"",{"$f":"IF(B310=0,0,IF(B310=\"N/A\",\"N/A\",IF(B310=\"\",\"\",IF(_xlfn.STDEV.P(D310:CY310)=0,0,IFERROR(_xlfn.CONFIDENCE.T('background calcs'!$Q$4,_xlfn.STDEV.S(D310:CY310),COUNT(D310:CY310)),\"N/A\")))))","v":""}]
[null,"",{"$f":"IF(B311=0,0,IF(B311=\"N/A\",\"N/A\",IF(B311=\"\",\"\",IF(_xlfn.STDEV.P(D311:CY311)=0,0,IFERROR(_xlfn.CONFIDENCE.T('background calcs'!$Q$4,_xlfn.STDEV.S(D311:CY311),COUNT(D311:CY311)),\"N/A\")))))","v":""}]
[null,"",{"$f":"IF(B312=0,0,IF(B312=\"N/A\",\"N/A\",IF(B312=\"\",\"\",IF(_xlfn.STDEV.P(D312:CY312)=0,0,IFERROR(_xlfn.CONFIDENCE.T('background calcs'!$Q$4,_xlfn.STDEV.S(D312:CY312),COUNT(D312:CY312)),\"N/A\")))))","v":""}]
[null,"",{"$f":"IF(B313=0,0,IF(B313=\"N/A\",\"N/A\",IF(B313=\"\",\"\",IF(_xlfn.STDEV.P(D313:CY313)=0,0,IFERROR(_xlfn.CONFIDENCE.T('background calcs'!$Q$4,_xlfn.STDEV.S(D313:CY313),COUNT(D313:CY313)),\"N/A\")))))","v":""}]
[null,"",{"$f":"IF(B314=0,0,IF(B314=\"N/A\",\"N/A\",IF(B314=\"\",\"\",IF(_xlfn.STDEV.P(D314:CY314)=0,0,IFERROR(_xlfn.CONFIDENCE.T('background calcs'!$Q$4,_xlfn.STDEV.S(D314:CY314),COUNT(D314:CY314)),\"N/A\")))))","v":""}]
[null,"",{"$f":"IF(B315=0,0,IF(B315=\"N/A\",\"N/A\",IF(B315=\"\",\"\",IF(_xlfn.STDEV.P(D315:CY315)=0,0,IFERROR(_xlfn.CONFIDENCE.T('background calcs'!$Q$4,_xlfn.STDEV.S(D315:CY315),COUNT(D315:CY315)),\"N/A\")))))","v":""}]
[null,"",{"$f":"IF(B316=0,0,IF(B316=\"N/A\",\"N/A\",IF(B316=\"\",\"\",IF(_xlfn.STDEV.P(D316:CY316)=0,0,IFERROR(_xlfn.CONFIDENCE.T('background calcs'!$Q$4,_xlfn.STDEV.S(D316:CY316),COUNT(D316:CY316)),\"N/A\")))))","v":""}]
[{"$f":"'Data entry template'!C321","v":"Notes:"},"N/A",{"$f":"IF(B317=0,0,IF(B317=\"N/A\",\"N/A\",IF(B317=\"\",\"\",IF(_xlfn.STDEV.P(D317:CY317)=0,0,IFERROR(_xlfn.CONFIDENCE.T('background calcs'!$Q$4,_xlfn.STDEV.S(D317:CY317),COUNT(D317:CY317)),\"N/A\")))))","v":"N/A"}]
[null,"",{"$f":"IF(B318=0,0,IF(B318=\"N/A\",\"N/A\",IF(B318=\"\",\"\",IF(_xlfn.STDEV.P(D318:CY318)=0,0,IFERROR(_xlfn.CONFIDENCE.T('background calcs'!$Q$4,_xlfn.STDEV.S(D318:CY318),COUNT(D318:CY318)),\"N/A\")))))","v":""}]
[{"$f":"'Data entry template'!C323","v":"4.19 A"},"N/A",{"$f":"IF(B319=0,0,IF(B319=\"N/A\",\"N/A\",IF(B319=\"\",\"\",IF(_xlfn.STDEV.P(D319:CY319)=0,0,IFERROR(_xlfn.CONFIDENCE.T('background calcs'!$Q$4,_xlfn.STDEV.S(D319:CY319),COUNT(D319:CY319)),\"N/A\")))))","v":"N/A"},""]
[null,"",{"$f":"IF(B320=0,0,IF(B320=\"N/A\",\"N/A\",IF(B320=\"\",\"\",IF(_xlfn.STDEV.P(D320:CY320)=0,0,IFERROR(_xlfn.CONFIDENCE.T('background calcs'!$Q$4,_xlfn.STDEV.S(D320:CY320),COUNT(D320:CY320)),\"N/A\")))))","v":""}]
[null,"",{"$f":"IF(B321=0,0,IF(B321=\"N/A\",\"N/A\",IF(B321=\"\",\"\",IF(_xlfn.STDEV.P(D321:CY321)=0,0,IFERROR(_xlfn.CONFIDENCE.T('background calcs'!$Q$4,_xlfn.STDEV.S(D321:CY321),COUNT(D321:CY321)),\"N/A\")))))","v":""}]
[null,"",{"$f":"IF(B322=0,0,IF(B322=\"N/A\",\"N/A\",IF(B322=\"\",\"\",IF(_xlfn.STDEV.P(D322:CY322)=0,0,IFERROR(_xlfn.CONFIDENCE.T('background calcs'!$Q$4,_xlfn.STDEV.S(D322:CY322),COUNT(D322:CY322)),\"N/A\")))))","v":""}]
[null,"",{"$f":"IF(B323=0,0,IF(B323=\"N/A\",\"N/A\",IF(B323=\"\",\"\",IF(_xlfn.STDEV.P(D323:CY323)=0,0,IFERROR(_xlfn.CONFIDENCE.T('background calcs'!$Q$4,_xlfn.STDEV.S(D323:CY323),COUNT(D323:CY323)),\"N/A\")))))","v":""}]
[null,"",{"$f":"IF(B324=0,0,IF(B324=\"N/A\",\"N/A\",IF(B324=\"\",\"\",IF(_xlfn.STDEV.P(D324:CY324)=0,0,IFERROR(_xlfn.CONFIDENCE.T('background calcs'!$Q$4,_xlfn.STDEV.S(D324:CY324),COUNT(D324:CY324)),\"N/A\")))))","v":""}]
[null,"",{"$f":"IF(B325=0,0,IF(B325=\"N/A\",\"N/A\",IF(B325=\"\",\"\",IF(_xlfn.STDEV.P(D325:CY325)=0,0,IFERROR(_xlfn.CONFIDENCE.T('background calcs'!$Q$4,_xlfn.STDEV.S(D325:CY325),COUNT(D325:CY325)),\"N/A\")))))","v":""}]
[null,"",{"$f":"IF(B326=0,0,IF(B326=\"N/A\",\"N/A\",IF(B326=\"\",\"\",IF(_xlfn.STDEV.P(D326:CY326)=0,0,IFERROR(_xlfn.CONFIDENCE.T('background calcs'!$Q$4,_xlfn.STDEV.S(D326:CY326),COUNT(D326:CY326)),\"N/A\")))))","v":""}]
[{"$f":"'Data entry template'!C331","v":"4.19 B"},"N/A",{"$f":"IF(B327=0,0,IF(B327=\"N/A\",\"N/A\",IF(B327=\"\",\"\",IF(_xlfn.STDEV.P(D327:CY327)=0,0,IFERROR(_xlfn.CONFIDENCE.T('background calcs'!$Q$4,_xlfn.STDEV.S(D327:CY327),COUNT(D327:CY327)),\"N/A\")))))","v":"N/A"},""]
[null,"",{"$f":"IF(B328=0,0,IF(B328=\"N/A\",\"N/A\",IF(B328=\"\",\"\",IF(_xlfn.STDEV.P(D328:CY328)=0,0,IFERROR(_xlfn.CONFIDENCE.T('background calcs'!$Q$4,_xlfn.STDEV.S(D328:CY328),COUNT(D328:CY328)),\"N/A\")))))","v":""}]
[null,"",{"$f":"IF(B329=0,0,IF(B329=\"N/A\",\"N/A\",IF(B329=\"\",\"\",IF(_xlfn.STDEV.P(D329:CY329)=0,0,IFERROR(_xlfn.CONFIDENCE.T('background calcs'!$Q$4,_xlfn.STDEV.S(D329:CY329),COUNT(D329:CY329)),\"N/A\")))))","v":""}]
[null,"",{"$f":"IF(B330=0,0,IF(B330=\"N/A\",\"N/A\",IF(B330=\"\",\"\",IF(_xlfn.STDEV.P(D330:CY330)=0,0,IFERROR(_xlfn.CONFIDENCE.T('background calcs'!$Q$4,_xlfn.STDEV.S(D330:CY330),COUNT(D330:CY330)),\"N/A\")))))","v":""}]
[null,"",{"$f":"IF(B331=0,0,IF(B331=\"N/A\",\"N/A\",IF(B331=\"\",\"\",IF(_xlfn.STDEV.P(D331:CY331)=0,0,IFERROR(_xlfn.CONFIDENCE.T('background calcs'!$Q$4,_xlfn.STDEV.S(D331:CY331),COUNT(D331:CY331)),\"N/A\")))))","v":""}]
[null,"",{"$f":"IF(B332=0,0,IF(B332=\"N/A\",\"N/A\",IF(B332=\"\",\"\",IF(_xlfn.STDEV.P(D332:CY332)=0,0,IFERROR(_xlfn.CONFIDENCE.T('background calcs'!$Q$4,_xlfn.STDEV.S(D332:CY332),COUNT(D332:CY332)),\"N/A\")))))","v":""}]
[null,"",{"$f":"IF(B333=0,0,IF(B333=\"N/A\",\"N/A\",IF(B333=\"\",\"\",IF(_xlfn.STDEV.P(D333:CY333)=0,0,IFERROR(_xlfn.CONFIDENCE.T('background calcs'!$Q$4,_xlfn.STDEV.S(D333:CY333),COUNT(D333:CY333)),\"N/A\")))))","v":""}]
[null,"",{"$f":"IF(B334=0,0,IF(B334=\"N/A\",\"N/A\",IF(B334=\"\",\"\",IF(_xlfn.STDEV.P(D334:CY334)=0,0,IFERROR(_xlfn.CONFIDENCE.T('background calcs'!$Q$4,_xlfn.STDEV.S(D334:CY334),COUNT(D334:CY334)),\"N/A\")))))","v":""}]
[{"$f":"'Data entry template'!C339","v":"Notes:"},"N/A",{"$f":"IF(B335=0,0,IF(B335=\"N/A\",\"N/A\",IF(B335=\"\",\"\",IF(_xlfn.STDEV.P(D335:CY335)=0,0,IFERROR(_xlfn.CONFIDENCE.T('background calcs'!$Q$4,_xlfn.STDEV.S(D335:CY335),COUNT(D335:CY335)),\"N/A\")))))","v":"N/A"}]
[null,"",{"$f":"IF(B336=0,0,IF(B336=\"N/A\",\"N/A\",IF(B336=\"\",\"\",IF(_xlfn.STDEV.P(D336:CY336)=0,0,IFERROR(_xlfn.CONFIDENCE.T('background calcs'!$Q$4,_xlfn.STDEV.S(D336:CY336),COUNT(D336:CY336)),\"N/A\")))))","v":""}]
[{"$f":"'Data entry template'!C341","v":"4.20 A"},"N/A",{"$f":"IF(B337=0,0,IF(B337=\"N/A\",\"N/A\",IF(B337=\"\",\"\",IF(_xlfn.STDEV.P(D337:CY337)=0,0,IFERROR(_xlfn.CONFIDENCE.T('background calcs'!$Q$4,_xlfn.STDEV.S(D337:CY337),COUNT(D337:CY337)),\"N/A\")))))","v":"N/A"},""]
[null,"",{"$f":"IF(B338=0,0,IF(B338=\"N/A\",\"N/A\",IF(B338=\"\",\"\",IF(_xlfn.STDEV.P(D338:CY338)=0,0,IFERROR(_xlfn.CONFIDENCE.T('background calcs'!$Q$4,_xlfn.STDEV.S(D338:CY338),COUNT(D338:CY338)),\"N/A\")))))","v":""}]
[null,"",{"$f":"IF(B339=0,0,IF(B339=\"N/A\",\"N/A\",IF(B339=\"\",\"\",IF(_xlfn.STDEV.P(D339:CY339)=0,0,IFERROR(_xlfn.CONFIDENCE.T('background calcs'!$Q$4,_xlfn.STDEV.S(D339:CY339),COUNT(D339:CY339)),\"N/A\")))))","v":""}]
[null,"",{"$f":"IF(B340=0,0,IF(B340=\"N/A\",\"N/A\",IF(B340=\"\",\"\",IF(_xlfn.STDEV.P(D340:CY340)=0,0,IFERROR(_xlfn.CONFIDENCE.T('background calcs'!$Q$4,_xlfn.STDEV.S(D340:CY340),COUNT(D340:CY340)),\"N/A\")))))","v":""}]
[null,"",{"$f":"IF(B341=0,0,IF(B341=\"N/A\",\"N/A\",IF(B341=\"\",\"\",IF(_xlfn.STDEV.P(D341:CY341)=0,0,IFERROR(_xlfn.CONFIDENCE.T('background calcs'!$Q$4,_xlfn.STDEV.S(D341:CY341),COUNT(D341:CY341)),\"N/A\")))))","v":""}]
[null,"",{"$f":"IF(B342=0,0,IF(B342=\"N/A\",\"N/A\",IF(B342=\"\",\"\",IF(_xlfn.STDEV.P(D342:CY342)=0,0,IFERROR(_xlfn.CONFIDENCE.T('background calcs'!$Q$4,_xlfn.STDEV.S(D342:CY342),COUNT(D342:CY342)),\"N/A\")))))","v":""}]
[null,"",{"$f":"IF(B343=0,0,IF(B343=\"N/A\",\"N/A\",IF(B343=\"\",\"\",IF(_xlfn.STDEV.P(D343:CY343)=0,0,IFERROR(_xlfn.CONFIDENCE.T('background calcs'!$Q$4,_xlfn.STDEV.S(D343:CY343),COUNT(D343:CY343)),\"N/A\")))))","v":""}]
[null,"",{"$f":"IF(B344=0,0,IF(B344=\"N/A\",\"N/A\",IF(B344=\"\",\"\",IF(_xlfn.STDEV.P(D344:CY344)=0,0,IFERROR(_xlfn.CONFIDENCE.T('background calcs'!$Q$4,_xlfn.STDEV.S(D344:CY344),COUNT(D344:CY344)),\"N/A\")))))","v":""}]
[{"$f":"'Data entry template'!C349","v":"4.20 B"},"N/A",{"$f":"IF(B345=0,0,IF(B345=\"N/A\",\"N/A\",IF(B345=\"\",\"\",IF(_xlfn.STDEV.P(D345:CY345)=0,0,IFERROR(_xlfn.CONFIDENCE.T('background calcs'!$Q$4,_xlfn.STDEV.S(D345:CY345),COUNT(D345:CY345)),\"N/A\")))))","v":"N/A"},""]
[null,"",{"$f":"IF(B346=0,0,IF(B346=\"N/A\",\"N/A\",IF(B346=\"\",\"\",IF(_xlfn.STDEV.P(D346:CY346)=0,0,IFERROR(_xlfn.CONFIDENCE.T('background calcs'!$Q$4,_xlfn.STDEV.S(D346:CY346),COUNT(D346:CY346)),\"N/A\")))))","v":""}]
[null,"",{"$f":"IF(B347=0,0,IF(B347=\"N/A\",\"N/A\",IF(B347=\"\",\"\",IF(_xlfn.STDEV.P(D347:CY347)=0,0,IFERROR(_xlfn.CONFIDENCE.T('background calcs'!$Q$4,_xlfn.STDEV.S(D347:CY347),COUNT(D347:CY347)),\"N/A\")))))","v":""}]
[null,"",{"$f":"IF(B348=0,0,IF(B348=\"N/A\",\"N/A\",IF(B348=\"\",\"\",IF(_xlfn.STDEV.P(D348:CY348)=0,0,IFERROR(_xlfn.CONFIDENCE.T('background calcs'!$Q$4,_xlfn.STDEV.S(D348:CY348),COUNT(D348:CY348)),\"N/A\")))))","v":""}]
[null,"",{"$f":"IF(B349=0,0,IF(B349=\"N/A\",\"N/A\",IF(B349=\"\",\"\",IF(_xlfn.STDEV.P(D349:CY349)=0,0,IFERROR(_xlfn.CONFIDENCE.T('background calcs'!$Q$4,_xlfn.STDEV.S(D349:CY349),COUNT(D349:CY349)),\"N/A\")))))","v":""}]
[null,"",{"$f":"IF(B350=0,0,IF(B350=\"N/A\",\"N/A\",IF(B350=\"\",\"\",IF(_xlfn.STDEV.P(D350:CY350)=0,0,IFERROR(_xlfn.CONFIDENCE.T('background calcs'!$Q$4,_xlfn.STDEV.S(D350:CY350),COUNT(D350:CY350)),\"N/A\")))))","v":""}]
[null,"",{"$f":"IF(B351=0,0,IF(B351=\"N/A\",\"N/A\",IF(B351=\"\",\"\",IF(_xlfn.STDEV.P(D351:CY351)=0,0,IFERROR(_xlfn.CONFIDENCE.T('background calcs'!$Q$4,_xlfn.STDEV.S(D351:CY351),COUNT(D351:CY351)),\"N/A\")))))","v":""}]
[null,{"$f":"IF(ISBLANK(A352),\"\",IF(COUNTBLANK(D352:CY352)=100,\"N/A\",IFERROR(AVERAGE(D352:CY352),\"\")))","v":""},{"$f":"IF(B352=0,0,IF(B352=\"N/A\",\"N/A\",IF(B352=\"\",\"\",IF(_xlfn.STDEV.P(D352:CY352)=0,0,IFERROR(_xlfn.CONFIDENCE.T('background calcs'!$Q$4,_xlfn.STDEV.S(D352:CY352),COUNT(D352:CY352)),\"N/A\")))))","v":""}]
[{"$f":"'Data entry template'!C357","v":"Notes:"},"N/A",{"$f":"IF(B353=0,0,IF(B353=\"N/A\",\"N/A\",IF(B353=\"\",\"\",IF(_xlfn.STDEV.P(D353:CY353)=0,0,IFERROR(_xlfn.CONFIDENCE.T('background calcs'!$Q$4,_xlfn.STDEV.S(D353:CY353),COUNT(D353:CY353)),\"N/A\")))))","v":"N/A"}]
[null,"",{"$f":"IF(B354=0,0,IF(B354=\"N/A\",\"N/A\",IF(B354=\"\",\"\",IF(_xlfn.STDEV.P(D354:CY354)=0,0,IFERROR(_xlfn.CONFIDENCE.T('background calcs'!$Q$4,_xlfn.STDEV.S(D354:CY354),COUNT(D354:CY354)),\"N/A\")))))","v":""}]
[{"$f":"'Data entry template'!C359","v":"4.21 A"},"N/A",{"$f":"IF(B355=0,0,IF(B355=\"N/A\",\"N/A\",IF(B355=\"\",\"\",IF(_xlfn.STDEV.P(D355:CY355)=0,0,IFERROR(_xlfn.CONFIDENCE.T('background calcs'!$Q$4,_xlfn.STDEV.S(D355:CY355),COUNT(D355:CY355)),\"N/A\")))))","v":"N/A"},""]
[null,"",{"$f":"IF(B356=0,0,IF(B356=\"N/A\",\"N/A\",IF(B356=\"\",\"\",IF(_xlfn.STDEV.P(D356:CY356)=0,0,IFERROR(_xlfn.CONFIDENCE.T('background calcs'!$Q$4,_xlfn.STDEV.S(D356:CY356),COUNT(D356:CY356)),\"N/A\")))))","v":""}]
[null,"",{"$f":"IF(B357=0,0,IF(B357=\"N/A\",\"N/A\",IF(B357=\"\",\"\",IF(_xlfn.STDEV.P(D357:CY357)=0,0,IFERROR(_xlfn.CONFIDENCE.T('background calcs'!$Q$4,_xlfn.STDEV.S(D357:CY357),COUNT(D357:CY357)),\"N/A\")))))","v":""}]
[null,"",{"$f":"IF(B358=0,0,IF(B358=\"N/A\",\"N/A\",IF(B358=\"\",\"\",IF(_xlfn.STDEV.P(D358:CY358)=0,0,IFERROR(_xlfn.CONFIDENCE.T('background calcs'!$Q$4,_xlfn.STDEV.S(D358:CY358),COUNT(D358:CY358)),\"N/A\")))))","v":""}]
[null,"",{"$f":"IF(B359=0,0,IF(B359=\"N/A\",\"N/A\",IF(B359=\"\",\"\",IF(_xlfn.STDEV.P(D359:CY359)=0,0,IFERROR(_xlfn.CONFIDENCE.T('background calcs'!$Q$4,_xlfn.STDEV.S(D359:CY359),COUNT(D359:CY359)),\"N/A\")))))","v":""}]
[null,"",{"$f":"IF(B360=0,0,IF(B360=\"N/A\",\"N/A\",IF(B360=\"\",\"\",IF(_xlfn.STDEV.P(D360:CY360)=0,0,IFERROR(_xlfn.CONFIDENCE.T('background calcs'!$Q$4,_xlfn.STDEV.S(D360:CY360),COUNT(D360:CY360)),\"N/A\")))))","v":""}]
[null,"",{"$f":"IF(B361=0,0,IF(B361=\"N/A\",\"N/A\",IF(B361=\"\",\"\",IF(_xlfn.STDEV.P(D361:CY361)=0,0,IFERROR(_xlfn.CONFIDENCE.T('background calcs'!$Q$4,_xlfn.STDEV.S(D361:CY361),COUNT(D361:CY361)),\"N/A\")))))","v":""}]
[null,"",{"$f":"IF(B362=0,0,IF(B362=\"N/A\",\"N/A\",IF(B362=\"\",\"\",IF(_xlfn.STDEV.P(D362:CY362)=0,0,IFERROR(_xlfn.CONFIDENCE.T('background calcs'!$Q$4,_xlfn.STDEV.S(D362:CY362),COUNT(D362:CY362)),\"N/A\")))))","v":""}]
[{"$f":"'Data entry template'!C367","v":"4.21 B"},"N/A",{"$f":"IF(B363=0,0,IF(B363=\"N/A\",\"N/A\",IF(B363=\"\",\"\",IF(_xlfn.STDEV.P(D363:CY363)=0,0,IFERROR(_xlfn.CONFIDENCE.T('background calcs'!$Q$4,_xlfn.STDEV.S(D363:CY363),COUNT(D363:CY363)),\"N/A\")))))","v":"N/A"},""]
[null,"",{"$f":"IF(B364=0,0,IF(B364=\"N/A\",\"N/A\",IF(B364=\"\",\"\",IF(_xlfn.STDEV.P(D364:CY364)=0,0,IFERROR(_xlfn.CONFIDENCE.T('background calcs'!$Q$4,_xlfn.STDEV.S(D364:CY364),COUNT(D364:CY364)),\"N/A\")))))","v":""}]
[null,"",{"$f":"IF(B365=0,0,IF(B365=\"N/A\",\"N/A\",IF(B365=\"\",\"\",IF(_xlfn.STDEV.P(D365:CY365)=0,0,IFERROR(_xlfn.CONFIDENCE.T('background calcs'!$Q$4,_xlfn.STDEV.S(D365:CY365),COUNT(D365:CY365)),\"N/A\")))))","v":""}]
[null,"",{"$f":"IF(B366=0,0,IF(B366=\"N/A\",\"N/A\",IF(B366=\"\",\"\",IF(_xlfn.STDEV.P(D366:CY366)=0,0,IFERROR(_xlfn.CONFIDENCE.T('background calcs'!$Q$4,_xlfn.STDEV.S(D366:CY366),COUNT(D366:CY366)),\"N/A\")))))","v":""}]
[null,"",{"$f":"IF(B367=0,0,IF(B367=\"N/A\",\"N/A\",IF(B367=\"\",\"\",IF(_xlfn.STDEV.P(D367:CY367)=0,0,IFERROR(_xlfn.CONFIDENCE.T('background calcs'!$Q$4,_xlfn.STDEV.S(D367:CY367),COUNT(D367:CY367)),\"N/A\")))))","v":""}]
[null,"",{"$f":"IF(B368=0,0,IF(B368=\"N/A\",\"N/A\",IF(B368=\"\",\"\",IF(_xlfn.STDEV.P(D368:CY368)=0,0,IFERROR(_xlfn.CONFIDENCE.T('background calcs'!$Q$4,_xlfn.STDEV.S(D368:CY368),COUNT(D368:CY368)),\"N/A\")))))","v":""}]
[null,"",{"$f":"IF(B369=0,0,IF(B369=\"N/A\",\"N/A\",IF(B369=\"\",\"\",IF(_xlfn.STDEV.P(D369:CY369)=0,0,IFERROR(_xlfn.CONFIDENCE.T('background calcs'!$Q$4,_xlfn.STDEV.S(D369:CY369),COUNT(D369:CY369)),\"N/A\")))))","v":""}]
[null,"",{"$f":"IF(B370=0,0,IF(B370=\"N/A\",\"N/A\",IF(B370=\"\",\"\",IF(_xlfn.STDEV.P(D370:CY370)=0,0,IFERROR(_xlfn.CONFIDENCE.T('background calcs'!$Q$4,_xlfn.STDEV.S(D370:CY370),COUNT(D370:CY370)),\"N/A\")))))","v":""}]
[{"$f":"'Data entry template'!C375","v":"Notes:"},"N/A",{"$f":"IF(B371=0,0,IF(B371=\"N/A\",\"N/A\",IF(B371=\"\",\"\",IF(_xlfn.STDEV.P(D371:CY371)=0,0,IFERROR(_xlfn.CONFIDENCE.T('background calcs'!$Q$4,_xlfn.STDEV.S(D371:CY371),COUNT(D371:CY371)),\"N/A\")))))","v":"N/A"}]
[null,"",{"$f":"IF(B372=0,0,IF(B372=\"N/A\",\"N/A\",IF(B372=\"\",\"\",IF(_xlfn.STDEV.P(D372:CY372)=0,0,IFERROR(_xlfn.CONFIDENCE.T('background calcs'!$Q$4,_xlfn.STDEV.S(D372:CY372),COUNT(D372:CY372)),\"N/A\")))))","v":""}]
[{"$f":"'Data entry template'!C377","v":"4.22 A"},"N/A",{"$f":"IF(B373=0,0,IF(B373=\"N/A\",\"N/A\",IF(B373=\"\",\"\",IF(_xlfn.STDEV.P(D373:CY373)=0,0,IFERROR(_xlfn.CONFIDENCE.T('background calcs'!$Q$4,_xlfn.STDEV.S(D373:CY373),COUNT(D373:CY373)),\"N/A\")))))","v":"N/A"},""]
[null,"",{"$f":"IF(B374=0,0,IF(B374=\"N/A\",\"N/A\",IF(B374=\"\",\"\",IF(_xlfn.STDEV.P(D374:CY374)=0,0,IFERROR(_xlfn.CONFIDENCE.T('background calcs'!$Q$4,_xlfn.STDEV.S(D374:CY374),COUNT(D374:CY374)),\"N/A\")))))","v":""}]
[null,"",{"$f":"IF(B375=0,0,IF(B375=\"N/A\",\"N/A\",IF(B375=\"\",\"\",IF(_xlfn.STDEV.P(D375:CY375)=0,0,IFERROR(_xlfn.CONFIDENCE.T('background calcs'!$Q$4,_xlfn.STDEV.S(D375:CY375),COUNT(D375:CY375)),\"N/A\")))))","v":""}]
[null,"",{"$f":"IF(B376=0,0,IF(B376=\"N/A\",\"N/A\",IF(B376=\"\",\"\",IF(_xlfn.STDEV.P(D376:CY376)=0,0,IFERROR(_xlfn.CONFIDENCE.T('background calcs'!$Q$4,_xlfn.STDEV.S(D376:CY376),COUNT(D376:CY376)),\"N/A\")))))","v":""}]
[null,"",{"$f":"IF(B377=0,0,IF(B377=\"N/A\",\"N/A\",IF(B377=\"\",\"\",IF(_xlfn.STDEV.P(D377:CY377)=0,0,IFERROR(_xlfn.CONFIDENCE.T('background calcs'!$Q$4,_xlfn.STDEV.S(D377:CY377),COUNT(D377:CY377)),\"N/A\")))))","v":""}]
[null,"",{"$f":"IF(B378=0,0,IF(B378=\"N/A\",\"N/A\",IF(B378=\"\",\"\",IF(_xlfn.STDEV.P(D378:CY378)=0,0,IFERROR(_xlfn.CONFIDENCE.T('background calcs'!$Q$4,_xlfn.STDEV.S(D378:CY378),COUNT(D378:CY378)),\"N/A\")))))","v":""}]
[null,"",{"$f":"IF(B379=0,0,IF(B379=\"N/A\",\"N/A\",IF(B379=\"\",\"\",IF(_xlfn.STDEV.P(D379:CY379)=0,0,IFERROR(_xlfn.CONFIDENCE.T('background calcs'!$Q$4,_xlfn.STDEV.S(D379:CY379),COUNT(D379:CY379)),\"N/A\")))))","v":""}]
[null,"",{"$f":"IF(B380=0,0,IF(B380=\"N/A\",\"N/A\",IF(B380=\"\",\"\",IF(_xlfn.STDEV.P(D380:CY380)=0,0,IFERROR(_xlfn.CONFIDENCE.T('background calcs'!$Q$4,_xlfn.STDEV.S(D380:CY380),COUNT(D380:CY380)),\"N/A\")))))","v":""}]
[{"$f":"'Data entry template'!C385","v":"4.22 B"},"N/A",{"$f":"IF(B381=0,0,IF(B381=\"N/A\",\"N/A\",IF(B381=\"\",\"\",IF(_xlfn.STDEV.P(D381:CY381)=0,0,IFERROR(_xlfn.CONFIDENCE.T('background calcs'!$Q$4,_xlfn.STDEV.S(D381:CY381),COUNT(D381:CY381)),\"N/A\")))))","v":"N/A"},""]
[null,"",{"$f":"IF(B382=0,0,IF(B382=\"N/A\",\"N/A\",IF(B382=\"\",\"\",IF(_xlfn.STDEV.P(D382:CY382)=0,0,IFERROR(_xlfn.CONFIDENCE.T('background calcs'!$Q$4,_xlfn.STDEV.S(D382:CY382),COUNT(D382:CY382)),\"N/A\")))))","v":""}]
[null,"",{"$f":"IF(B383=0,0,IF(B383=\"N/A\",\"N/A\",IF(B383=\"\",\"\",IF(_xlfn.STDEV.P(D383:CY383)=0,0,IFERROR(_xlfn.CONFIDENCE.T('background calcs'!$Q$4,_xlfn.STDEV.S(D383:CY383),COUNT(D383:CY383)),\"N/A\")))))","v":""}]
[null,"",{"$f":"IF(B384=0,0,IF(B384=\"N/A\",\"N/A\",IF(B384=\"\",\"\",IF(_xlfn.STDEV.P(D384:CY384)=0,0,IFERROR(_xlfn.CONFIDENCE.T('background calcs'!$Q$4,_xlfn.STDEV.S(D384:CY384),COUNT(D384:CY384)),\"N/A\")))))","v":""}]
[null,"",{"$f":"IF(B385=0,0,IF(B385=\"N/A\",\"N/A\",IF(B385=\"\",\"\",IF(_xlfn.STDEV.P(D385:CY385)=0,0,IFERROR(_xlfn.CONFIDENCE.T('background calcs'!$Q$4,_xlfn.STDEV.S(D385:CY385),COUNT(D385:CY385)),\"N/A\")))))","v":""}]
[null,"",{"$f":"IF(B386=0,0,IF(B386=\"N/A\",\"N/A\",IF(B386=\"\",\"\",IF(_xlfn.STDEV.P(D386:CY386)=0,0,IFERROR(_xlfn.CONFIDENCE.T('background calcs'!$Q$4,_xlfn.STDEV.S(D386:CY386),COUNT(D386:CY386)),\"N/A\")))))","v":""}]
[null,"",{"$f":"IF(B387=0,0,IF(B387=\"N/A\",\"N/A\",IF(B387=\"\",\"\",IF(_xlfn.STDEV.P(D387:CY387)=0,0,IFERROR(_xlfn.CONFIDENCE.T('background calcs'!$Q$4,_xlfn.STDEV.S(D387:CY387),COUNT(D387:CY387)),\"N/A\")))))","v":""}]
[null,"",{"$f":"IF(B388=0,0,IF(B388=\"N/A\",\"N/A\",IF(B388=\"\",\"\",IF(_xlfn.STDEV.P(D388:CY388)=0,0,IFERROR(_xlfn.CONFIDENCE.T('background calcs'!$Q$4,_xlfn.STDEV.S(D388:CY388),COUNT(D388:CY388)),\"N/A\")))))","v":""}]
[{"$f":"'Data entry template'!C393","v":"Notes:"},"N/A",{"$f":"IF(B389=0,0,IF(B389=\"N/A\",\"N/A\",IF(B389=\"\",\"\",IF(_xlfn.STDEV.P(D389:CY389)=0,0,IFERROR(_xlfn.CONFIDENCE.T('background calcs'!$Q$4,_xlfn.STDEV.S(D389:CY389),COUNT(D389:CY389)),\"N/A\")))))","v":"N/A"}]
[null,"",{"$f":"IF(B390=0,0,IF(B390=\"N/A\",\"N/A\",IF(B390=\"\",\"\",IF(_xlfn.STDEV.P(D390:CY390)=0,0,IFERROR(_xlfn.CONFIDENCE.T('background calcs'!$Q$4,_xlfn.STDEV.S(D390:CY390),COUNT(D390:CY390)),\"N/A\")))))","v":""}]
[{"$f":"'Data entry template'!C395","v":"4.23 A"},"N/A",{"$f":"IF(B391=0,0,IF(B391=\"N/A\",\"N/A\",IF(B391=\"\",\"\",IF(_xlfn.STDEV.P(D391:CY391)=0,0,IFERROR(_xlfn.CONFIDENCE.T('background calcs'!$Q$4,_xlfn.STDEV.S(D391:CY391),COUNT(D391:CY391)),\"N/A\")))))","v":"N/A"},""]
[null,"",{"$f":"IF(B392=0,0,IF(B392=\"N/A\",\"N/A\",IF(B392=\"\",\"\",IF(_xlfn.STDEV.P(D392:CY392)=0,0,IFERROR(_xlfn.CONFIDENCE.T('background calcs'!$Q$4,_xlfn.STDEV.S(D392:CY392),COUNT(D392:CY392)),\"N/A\")))))","v":""}]
[null,"",{"$f":"IF(B393=0,0,IF(B393=\"N/A\",\"N/A\",IF(B393=\"\",\"\",IF(_xlfn.STDEV.P(D393:CY393)=0,0,IFERROR(_xlfn.CONFIDENCE.T('background calcs'!$Q$4,_xlfn.STDEV.S(D393:CY393),COUNT(D393:CY393)),\"N/A\")))))","v":""}]
[null,"",{"$f":"IF(B394=0,0,IF(B394=\"N/A\",\"N/A\",IF(B394=\"\",\"\",IF(_xlfn.STDEV.P(D394:CY394)=0,0,IFERROR(_xlfn.CONFIDENCE.T('background calcs'!$Q$4,_xlfn.STDEV.S(D394:CY394),COUNT(D394:CY394)),\"N/A\")))))","v":""}]
[null,"",{"$f":"IF(B395=0,0,IF(B395=\"N/A\",\"N/A\",IF(B395=\"\",\"\",IF(_xlfn.STDEV.P(D395:CY395)=0,0,IFERROR(_xlfn.CONFIDENCE.T('background calcs'!$Q$4,_xlfn.STDEV.S(D395:CY395),COUNT(D395:CY395)),\"N/A\")))))","v":""}]
[null,"",{"$f":"IF(B396=0,0,IF(B396=\"N/A\",\"N/A\",IF(B396=\"\",\"\",IF(_xlfn.STDEV.P(D396:CY396)=0,0,IFERROR(_xlfn.CONFIDENCE.T('background calcs'!$Q$4,_xlfn.STDEV.S(D396:CY396),COUNT(D396:CY396)),\"N/A\")))))","v":""}]
[null,"",{"$f":"IF(B397=0,0,IF(B397=\"N/A\",\"N/A\",IF(B397=\"\",\"\",IF(_xlfn.STDEV.P(D397:CY397)=0,0,IFERROR(_xlfn.CONFIDENCE.T('background calcs'!$Q$4,_xlfn.STDEV.S(D397:CY397),COUNT(D397:CY397)),\"N/A\")))))","v":""}]
[null,"",{"$f":"IF(B398=0,0,IF(B398=\"N/A\",\"N/A\",IF(B398=\"\",\"\",IF(_xlfn.STDEV.P(D398:CY398)=0,0,IFERROR(_xlfn.CONFIDENCE.T('background calcs'!$Q$4,_xlfn.STDEV.S(D398:CY398),COUNT(D398:CY398)),\"N/A\")))))","v":""}]
[{"$f":"'Data entry template'!C403","v":"4.23 B"},"N/A",{"$f":"IF(B399=0,0,IF(B399=\"N/A\",\"N/A\",IF(B399=\"\",\"\",IF(_xlfn.STDEV.P(D399:CY399)=0,0,IFERROR(_xlfn.CONFIDENCE.T('background calcs'!$Q$4,_xlfn.STDEV.S(D399:CY399),COUNT(D399:CY399)),\"N/A\")))))","v":"N/A"},""]
[null,"",{"$f":"IF(B400=0,0,IF(B400=\"N/A\",\"N/A\",IF(B400=\"\",\"\",IF(_xlfn.STDEV.P(D400:CY400)=0,0,IFERROR(_xlfn.CONFIDENCE.T('background calcs'!$Q$4,_xlfn.STDEV.S(D400:CY400),COUNT(D400:CY400)),\"N/A\")))))","v":""}]
[null,"",{"$f":"IF(B401=0,0,IF(B401=\"N/A\",\"N/A\",IF(B401=\"\",\"\",IF(_xlfn.STDEV.P(D401:CY401)=0,0,IFERROR(_xlfn.CONFIDENCE.T('background calcs'!$Q$4,_xlfn.STDEV.S(D401:CY401),COUNT(D401:CY401)),\"N/A\")))))","v":""}]
[null,"",{"$f":"IF(B402=0,0,IF(B402=\"N/A\",\"N/A\",IF(B402=\"\",\"\",IF(_xlfn.STDEV.P(D402:CY402)=0,0,IFERROR(_xlfn.CONFIDENCE.T('background calcs'!$Q$4,_xlfn.STDEV.S(D402:CY402),COUNT(D402:CY402)),\"N/A\")))))","v":""}]
[null,"",{"$f":"IF(B403=0,0,IF(B403=\"N/A\",\"N/A\",IF(B403=\"\",\"\",IF(_xlfn.STDEV.P(D403:CY403)=0,0,IFERROR(_xlfn.CONFIDENCE.T('background calcs'!$Q$4,_xlfn.STDEV.S(D403:CY403),COUNT(D403:CY403)),\"N/A\")))))","v":""}]
[null,"",{"$f":"IF(B404=0,0,IF(B404=\"N/A\",\"N/A\",IF(B404=\"\",\"\",IF(_xlfn.STDEV.P(D404:CY404)=0,0,IFERROR(_xlfn.CONFIDENCE.T('background calcs'!$Q$4,_xlfn.STDEV.S(D404:CY404),COUNT(D404:CY404)),\"N/A\")))))","v":""}]
[null,"",{"$f":"IF(B405=0,0,IF(B405=\"N/A\",\"N/A\",IF(B405=\"\",\"\",IF(_xlfn.STDEV.P(D405:CY405)=0,0,IFERROR(_xlfn.CONFIDENCE.T('background calcs'!$Q$4,_xlfn.STDEV.S(D405:CY405),COUNT(D405:CY405)),\"N/A\")))))","v":""}]
[null,"",{"$f":"IF(B406=0,0,IF(B406=\"N/A\",\"N/A\",IF(B406=\"\",\"\",IF(_xlfn.STDEV.P(D406:CY406)=0,0,IFERROR(_xlfn.CONFIDENCE.T('background calcs'!$Q$4,_xlfn.STDEV.S(D406:CY406),COUNT(D406:CY406)),\"N/A\")))))","v":""}]
[{"$f":"'Data entry template'!C411","v":"Notes:"},"N/A",{"$f":"IF(B407=0,0,IF(B407=\"N/A\",\"N/A\",IF(B407=\"\",\"\",IF(_xlfn.STDEV.P(D407:CY407)=0,0,IFERROR(_xlfn.CONFIDENCE.T('background calcs'!$Q$4,_xlfn.STDEV.S(D407:CY407),COUNT(D407:CY407)),\"N/A\")))))","v":"N/A"}]
[null,"",{"$f":"IF(B408=0,0,IF(B408=\"N/A\",\"N/A\",IF(B408=\"\",\"\",IF(_xlfn.STDEV.P(D408:CY408)=0,0,IFERROR(_xlfn.CONFIDENCE.T('background calcs'!$Q$4,_xlfn.STDEV.S(D408:CY408),COUNT(D408:CY408)),\"N/A\")))))","v":""}]
[null,"",{"$f":"IF(B409=0,0,IF(B409=\"N/A\",\"N/A\",IF(B409=\"\",\"\",IF(_xlfn.STDEV.P(D409:CY409)=0,0,IFERROR(_xlfn.CONFIDENCE.T('background calcs'!$Q$4,_xlfn.STDEV.S(D409:CY409),COUNT(D409:CY409)),\"N/A\")))))","v":""}]
[{"$f":"$A$418&\"a\"","v":"4.24a"},{"$f":"COUNTIF(D410:CY410,\"Pass\")","v":0},{"$f":"COUNTIF(D410:CY410,\"fail\")","v":0},"N/A"]
[{"$f":"$A$418&\"b\"","v":"4.24b"},{"$f":"COUNTIF(D411:CY411,\"Pass\")","v":0},{"$f":"COUNTIF(D411:CY411,\"fail\")","v":0},"N/A"]
[{"$f":"$A$418&\"c\"","v":"4.24c"},0,0,"N/A"]
[{"$f":"$A$418&\"d\"","v":"4.24d"},0,0,"N/A"]
[{"$f":"$A$418&\"e\"","v":"4.24e"},0,0,"N/A"]
[{"$f":"$A$418&\"f\"","v":"4.24f"},0,0,"N/A"]
[{"$f":"$A$418&\"g\"","v":"4.24g"},0,0,"N/A"]
[{"$f":"$A$418&\"h\"","v":"4.24h"},0,0,"N/A"]
[{"$f":"'Data entry template'!C413","v":4.24},{"$f":"SUM(B410:B417)","v":0},{"$f":"SUM(C410:C417)","v":0}]
[]
[{"$f":"'Data entry template'!C424","v":"4.25 A"},{"$f":"IF(ISBLANK(A420),\"\",IF(COUNTBLANK(D420:CY420)=100,\"N/A\",IFERROR(AVERAGE(D420:CY420),\"\")))","v":"N/A"},{"$f":"IF(B420=0,0,IF(B420=\"N/A\",\"N/A\",IF(B420=\"\",\"\",IF(_xlfn.STDEV.P(D420:CY420)=0,0,IFERROR(_xlfn.CONFIDENCE.T('background calcs'!$Q$4,_xlfn.STDEV.S(D420:CY420),COUNT(D420:CY420)),\"N/A\")))))","v":"N/A"},""]
[null,"",{"$f":"IF(B421=0,0,IF(B421=\"N/A\",\"N/A\",IF(B421=\"\",\"\",IF(_xlfn.STDEV.P(D421:CY421)=0,0,IFERROR(_xlfn.CONFIDENCE.T('background calcs'!$Q$4,_xlfn.STDEV.S(D421:CY421),COUNT(D421:CY421)),\"N/A\")))))","v":""}]
[null,"",{"$f":"IF(B422=0,0,IF(B422=\"N/A\",\"N/A\",IF(B422=\"\",\"\",IF(_xlfn.STDEV.P(D422:CY422)=0,0,IFERROR(_xlfn.CONFIDENCE.T('background calcs'!$Q$4,_xlfn.STDEV.S(D422:CY422),COUNT(D422:CY422)),\"N/A\")))))","v":""}]
[null,"",{"$f":"IF(B423=0,0,IF(B423=\"N/A\",\"N/A\",IF(B423=\"\",\"\",IF(_xlfn.STDEV.P(D423:CY423)=0,0,IFERROR(_xlfn.CONFIDENCE.T('background calcs'!$Q$4,_xlfn.STDEV.S(D423:CY423),COUNT(D423:CY423)),\"N/A\")))))","v":""}]
[null,"",{"$f":"IF(B424=0,0,IF(B424=\"N/A\",\"N/A\",IF(B424=\"\",\"\",IF(_xlfn.STDEV.P(D424:CY424)=0,0,IFERROR(_xlfn.CONFIDENCE.T('background calcs'!$Q$4,_xlfn.STDEV.S(D424:CY424),COUNT(D424:CY424)),\"N/A\")))))","v":""}]
[null,"",{"$f":"IF(B425=0,0,IF(B425=\"N/A\",\"N/A\",IF(B425=\"\",\"\",IF(_xlfn.STDEV.P(D425:CY425)=0,0,IFERROR(_xlfn.CONFIDENCE.T('background calcs'!$Q$4,_xlfn.STDEV.S(D425:CY425),COUNT(D425:CY425)),\"N/A\")))))","v":""}]
[null,"",{"$f":"IF(B426=0,0,IF(B426=\"N/A\",\"N/A\",IF(B426=\"\",\"\",IF(_xlfn.STDEV.P(D426:CY426)=0,0,IFERROR(_xlfn.CONFIDENCE.T('background calcs'!$Q$4,_xlfn.STDEV.S(D426:CY426),COUNT(D426:CY426)),\"N/A\")))))","v":""}]
[null,"",{"$f":"IF(B427=0,0,IF(B427=\"N/A\",\"N/A\",IF(B427=\"\",\"\",IF(_xlfn.STDEV.P(D427:CY427)=0,0,IFERROR(_xlfn.CONFIDENCE.T('background calcs'!$Q$4,_xlfn.STDEV.S(D427:CY427),COUNT(D427:CY427)),\"N/A\")))))","v":""}]
[{"$f":"'Data entry template'!C432","v":"4.25 B"},"N/A",{"$f":"IF(B428=0,0,IF(B428=\"N/A\",\"N/A\",IF(B428=\"\",\"\",IF(_xlfn.STDEV.P(D428:CY428)=0,0,IFERROR(_xlfn.CONFIDENCE.T('background calcs'!$Q$4,_xlfn.STDEV.S(D428:CY428),COUNT(D428:CY428)),\"N/A\")))))","v":"N/A"},""]
[null,"",{"$f":"IF(B429=0,0,IF(B429=\"N/A\",\"N/A\",IF(B429=\"\",\"\",IF(_xlfn.STDEV.P(D429:CY429)=0,0,IFERROR(_xlfn.CONFIDENCE.T('background calcs'!$Q$4,_xlfn.STDEV.S(D429:CY429),COUNT(D429:CY429)),\"N/A\")))))","v":""}]
[null,"",{"$f":"IF(B430=0,0,IF(B430=\"N/A\",\"N/A\",IF(B430=\"\",\"\",IF(_xlfn.STDEV.P(D430:CY430)=0,0,IFERROR(_xlfn.CONFIDENCE.T('background calcs'!$Q$4,_xlfn.STDEV.S(D430:CY430),COUNT(D430:CY430)),\"N/A\")))))","v":""}]
[null,"",{"$f":"IF(B431=0,0,IF(B431=\"N/A\",\"N/A\",IF(B431=\"\",\"\",IF(_xlfn.STDEV.P(D431:CY431)=0,0,IFERROR(_xlfn.CONFIDENCE.T('background calcs'!$Q$4,_xlfn.STDEV.S(D431:CY431),COUNT(D431:CY431)),\"N/A\")))))","v":""}]
[null,"",{"$f":"IF(B432=0,0,IF(B432=\"N/A\",\"N/A\",IF(B432=\"\",\"\",IF(_xlfn.STDEV.P(D432:CY432)=0,0,IFERROR(_xlfn.CONFIDENCE.T('background calcs'!$Q$4,_xlfn.STDEV.S(D432:CY432),COUNT(D432:CY432)),\"N/A\")))))","v":""}]
[null,"",{"$f":"IF(B433=0,0,IF(B433=\"N/A\",\"N/A\",IF(B433=\"\",\"\",IF(_xlfn.STDEV.P(D433:CY433)=0,0,IFERROR(_xlfn.CONFIDENCE.T('background calcs'!$Q$4,_xlfn.STDEV.S(D433:CY433),COUNT(D433:CY433)),\"N/A\")))))","v":""}]
[null,"",{"$f":"IF(B434=0,0,IF(B434=\"N/A\",\"N/A\",IF(B434=\"\",\"\",IF(_xlfn.STDEV.P(D434:CY434)=0,0,IFERROR(_xlfn.CONFIDENCE.T('background calcs'!$Q$4,_xlfn.STDEV.S(D434:CY434),COUNT(D434:CY434)),\"N/A\")))))","v":""}]
[null,"",{"$f":"IF(B435=0,0,IF(B435=\"N/A\",\"N/A\",IF(B435=\"\",\"\",IF(_xlfn.STDEV.P(D435:CY435)=0,0,IFERROR(_xlfn.CONFIDENCE.T('background calcs'!$Q$4,_xlfn.STDEV.S(D435:CY435),COUNT(D435:CY435)),\"N/A\")))))","v":""}]
[{"$f":"'Data entry template'!C440","v":"Notes:"},"N/A",{"$f":"IF(B436=0,0,IF(B436=\"N/A\",\"N/A\",IF(B436=\"\",\"\",IF(_xlfn.STDEV.P(D436:CY436)=0,0,IFERROR(_xlfn.CONFIDENCE.T('background calcs'!$Q$4,_xlfn.STDEV.S(D436:CY436),COUNT(D436:CY436)),\"N/A\")))))","v":"N/A"}]
[null,"",{"$f":"IF(B437=0,0,IF(B437=\"N/A\",\"N/A\",IF(B437=\"\",\"\",IF(_xlfn.STDEV.P(D437:CY437)=0,0,IFERROR(_xlfn.CONFIDENCE.T('background calcs'!$Q$4,_xlfn.STDEV.S(D437:CY437),COUNT(D437:CY437)),\"N/A\")))))","v":""}]
[{"$f":"'Data entry template'!C442","v":4.2599999999999971},"N/A",{"$f":"IF(B438=0,0,IF(B438=\"N/A\",\"N/A\",IF(B438=\"\",\"\",IF(_xlfn.STDEV.P(D438:CY438)=0,0,IFERROR(_xlfn.CONFIDENCE.T('background calcs'!$Q$4,_xlfn.STDEV.S(D438:CY438),COUNT(D438:CY438)),\"N/A\")))))","v":"N/A"}]
[null,"",{"$f":"IF(B439=0,0,IF(B439=\"N/A\",\"N/A\",IF(B439=\"\",\"\",IF(_xlfn.STDEV.P(D439:CY439)=0,0,IFERROR(_xlfn.CONFIDENCE.T('background calcs'!$Q$4,_xlfn.STDEV.S(D439:CY439),COUNT(D439:CY439)),\"N/A\")))))","v":""}]
[null,"",{"$f":"IF(B440=0,0,IF(B440=\"N/A\",\"N/A\",IF(B440=\"\",\"\",IF(_xlfn.STDEV.P(D440:CY440)=0,0,IFERROR(_xlfn.CONFIDENCE.T('background calcs'!$Q$4,_xlfn.STDEV.S(D440:CY440),COUNT(D440:CY440)),\"N/A\")))))","v":""}]
[null,"",{"$f":"IF(B441=0,0,IF(B441=\"N/A\",\"N/A\",IF(B441=\"\",\"\",IF(_xlfn.STDEV.P(D441:CY441)=0,0,IFERROR(_xlfn.CONFIDENCE.T('background calcs'!$Q$4,_xlfn.STDEV.S(D441:CY441),COUNT(D441:CY441)),\"N/A\")))))","v":""}]
[{"$f":"'Data entry template'!C446","v":"Notes:"},"N/A",{"$f":"IF(B442=0,0,IF(B442=\"N/A\",\"N/A\",IF(B442=\"\",\"\",IF(_xlfn.STDEV.P(D442:CY442)=0,0,IFERROR(_xlfn.CONFIDENCE.T('background calcs'!$Q$4,_xlfn.STDEV.S(D442:CY442),COUNT(D442:CY442)),\"N/A\")))))","v":"N/A"}]
[null,"",{"$f":"IF(B443=0,0,IF(B443=\"N/A\",\"N/A\",IF(B443=\"\",\"\",IF(_xlfn.STDEV.P(D443:CY443)=0,0,IFERROR(_xlfn.CONFIDENCE.T('background calcs'!$Q$4,_xlfn.STDEV.S(D443:CY443),COUNT(D443:CY443)),\"N/A\")))))","v":""}]
[{"$f":"'Data entry template'!C448","v":4.2699999999999996},"N/A",{"$f":"IF(B444=0,0,IF(B444=\"N/A\",\"N/A\",IF(B444=\"\",\"\",IF(_xlfn.STDEV.P(D444:CY444)=0,0,IFERROR(_xlfn.CONFIDENCE.T('background calcs'!$Q$4,_xlfn.STDEV.S(D444:CY444),COUNT(D444:CY444)),\"N/A\")))))","v":"N/A"},""]
[null,null,{"$f":"IFERROR(_xlfn.STDEV.S(D445:CY445)/AVERAGE(D445:CY445),\"\")","v":""}]
[null,null,""]
[null,null,""]
[null,null,""]
[null,null,""]
[{"$f":"'Data entry template'!C454","v":"Notes:"},null,""]
[null,null,"","\"Can you list a few of your favorite things about your stove? Why are they important to you?\""]
[{"$f":"'Data entry template'!C457","v":5.0999999999999996},null,""]
[null,null,""]
[null,null,"","\"Can you list a few of your least favorite things about your stove? Why are they important to you?\""]
[{"$f":"'Data entry template'!C460","v":5.2},null,""]
[null,null,""]
[null,null,"","“Is there anything you would like to change about your stove?”"]
[{"$f":"'Data entry template'!C463","v":5.3},null,""]
[null,null,""]
[null,null,{"$f":"IFERROR(_xlfn.STDEV.S(D460:CY460)/AVERAGE(D460:CY460),\"\")","v":""},"\"Is there anything else you would like to tell me about your stove or cooking in general?\""]
[{"$f":"'Data entry template'!C466","v":5.4},null,""]
[null,null,""]
[null,null,""]
[{"$f":"'Data entry template'!C469","v":5.5},null,""]
[null,null,""]

{"sheet":"Data entry template","index":4,"n_rows":469,"n_cols":20,"rows_kept":469,"cut":false,"hidden":true,"merged":[[463,9,463,10],[463,12,463,13],[463,15,463,16],[463,18,463,19],[466,9,466,10],[466,12,466,13],[466,15,466,16],[466,18,466,19],[469,9,469,10],[469,12,469,13],[469,15,469,16],[469,18,469,19],[454,9,456,19],[457,9,457,10],[457,12,457,13],[457,15,457,16],[457,18,457,19],[460,9,460,10],[460,12,460,13],[460,15,460,16],[460,18,460,19],[1,8,1,9],[7,14,7,15],[8,14,8,15],[9,14,9,15],[10,14,10,15],[11,14,11,15],[12,14,12,15],[312,3,312,5],[322,3,322,5],[132,3,132,5],[55,9,56,9],[113,3,113,5],[241,3,241,5],[257,3,257,5],[270,3,270,5],[283,3,283,5],[302,3,302,5],[55,12,56,12],[55,15,56,15],[330,3,330,5],[340,3,340,5],[320,3,320,5],[338,3,338,5],[356,3,356,5],[374,3,374,5],[431,3,431,5],[394,3,394,5],[402,3,402,5],[412,3,412,5],[423,3,423,5],[348,3,348,5],[358,3,358,5],[366,3,366,5],[14,1,32,1],[34,1,90,1],[86,3,86,5],[89,3,89,5],[92,1,454,1],[92,3,92,5],[96,3,96,5],[100,3,100,5],[104,3,104,5],[109,3,109,5],[148,3,148,5],[156,3,156,5],[166,3,166,5],[174,3,174,5],[184,3,184,5],[192,3,192,5],[202,3,202,5],[210,3,210,5],[220,3,220,5],[228,3,228,5],[238,3,238,5],[243,3,243,5],[249,3,249,5],[259,3,259,5],[6,1,12,1],[6,3,6,4],[7,3,7,4],[8,3,8,4],[9,3,9,4],[10,3,10,4],[11,3,11,4],[12,3,12,4],[10,5,10,9],[11,5,11,9],[12,5,12,9],[6,5,6,9],[7,5,7,9],[8,5,8,9],[9,5,9,9],[55,19,56,19],[456,1,470,1],[456,3,456,5],[457,3,457,5],[459,3,459,5],[460,3,460,5],[462,3,462,5],[463,3,463,5],[465,3,465,5],[466,3,466,5],[468,3,468,5],[469,3,469,5],[115,3,115,5],[123,3,123,5],[134,3,134,5],[140,3,140,5],[262,3,262,5],[272,3,272,5],[275,3,275,5],[285,3,285,5],[294,3,294,5],[376,3,376,5],[384,3,384,5],[304,3,304,5],[55,18,56,18],[138,3,138,5],[164,3,164,5],[182,3,182,5],[200,3,200,5],[218,3,218,5],[236,3,236,5],[55,10,56,10],[55,13,56,13],[55,16,56,16],[445,3,445,5],[453,3,453,5],[439,3,439,5],[441,3,441,5],[447,3,447,5],[392,3,392,5],[410,3,410,5],[413,8,413,9],[414,8,414,9],[415,8,415,9],[416,8,416,9],[417,8,417,9],[418,8,418,9],[419,8,419,9],[420,8,420,9],[421,8,421,9],[453,9,453,19]]}
[]
[null,"Data Entry Form\n",null,null,null,null,"Test Number:"]
[]
[null,"Enter test data in grey cells"]
[null,"Blue cells are calculated automatically"]
[]
[null,"1. Participant ID",1.1000000000000001,"Date"]
[null,null,1.2,"Time of visit"]
[null,null,1.3,"Study region"]
[null,null,1.4,"Household name or ID number "]
[null,null,1.5,"Name of main cook "]
[null,null,1.6,"Test Administrator name(s) or ID number(s)"]
[null,null,1.7,"Stove model(s) used during cooking evaluation"]
[]
[null,"2. Cookstove Characteristics Evaluation",2.1,"Ease of lighting"]
[null,null,null,null,"Kindling or accelerants are required:"]
[null,null,null,null,"Fire must be lit in an enclosed space within the stove:"]
[]
[null,null,2.2000000000000002,"Fuel feed entry or loading area size "]
[null,null,null,null,"Three stone fire/unrestricted fuel feed:"]
[null,null,null,null,null,"IF NO:"]
[null,null,null,null,"Width (cm):"]
[null,null,null,null,"Height (cm):"]
[null,null,null,null,null,"OR"]
[null,null,null,null,"Diameter (cm):"]
[]
[null,null,2.2999999999999998,"Indoor soot evaluation"]
[null,null,null,null,"Gas, alcohol, or electric power:"]
[null,null,null,null,"Sealed chimney:"]
[]
[null,null,2.4,"Burner count"]
[null,null,null,null,"Number of burners (or \"plancha\"):"]
[]
[]
[null,"3. User Cooking Event Observation",3.1,"Fuel preparation"]
[null,null,null,null,"Start time (hh:mm):"]
[null,null,null,null,"Completion time (hh:mm):"]
[null,null,null,null,"Specialized knowledge or tools required for fuel preparation:"]
[]
[null,null,3.2,"Lighting time required"]
[null,null,null,null,"Start time (hh:mm):"]
[null,null,null,null,"Completion time (hh:mm):"]
[]
[null,null,3.3,"Fuel consumption "]
[null,null,null,null,"Initial mass (kg)"]
[null,null,null,null,"Final mass (kg)"]
[]
[null,null,null,null,"Total fuel consumption (kg)",{"$f":"IF(F46-F45<0,F45-F46,0)","v":0}]
[]
[null,null,3.4,"Cooking time"]
[null,null,null,null,"Start time (hh:mm):"]
[null,null,null,null,"Completion time (hh:mm):"]
[]
[null,null,null,null,"Cooking duration (hh:mm):",{"$f":"IF(F52-F51>0,F52-F51,0)","v":"00:00:00"},null,null,null,"Min times in columns"]
[null,null,null,null,null,null,null,null,null,{"$f":"IFERROR(SMALL(J58:J64,COUNTIF(J58:J64,0)+1),\"\")","v":""},null,null,{"$f":"IFERROR(SMALL(M58:M64,COUNTIF(M58:M64,0)+1),\"\")","v":""},null,null,{"$f":"IFERROR(SMALL(P58:P64,COUNTIF(P58:P64,0)+1),\"\")","v":""},null,null,{"$f":"IFERROR(SMALL(S58:S64,COUNTIF(S58:S64,0)+1),\"\")","v":""}]
[null,null,3.5,"Tending and refueling frequency",null,null,null,null,null,"Time tended","Stove refueled?",null,"Time tended","Stove refueled?",null,"Time tended","Stove refueled?",null,"Time tended","Stove refueled?"]
[null,null,null,"Enter the time of each tending event in the cells at right."]
[null,null,null,"Check the box next to the cell if the stove was also refueled.",null,null,null,null,1,null,null,8,null,null,15,null,null,22]
[null,null,null,null,null,null,null,null,2,null,null,9,null,null,16,null,null,23]
[null,null,null,null,null,null,null,null,3,null,null,10,null,null,17,null,null,24]
[null,null,null,null,null,null,null,null,4,null,null,11,null,null,18,null,null,25]
[null,null,null,null,"Average tending interval (minutes):",{"$f":"IFERROR((MAX(J58:J64,M58:M64,P58:P64,S58:S64)-MIN(J55:S55))*(24*60)/(COUNTA(J58:J64,M58:M64,P58:P64,S58:S64)-1),\"\")","v":0},null,null,5,null,null,12,null,null,19,null,null,26]
[null,null,null,null,"Average refueling interval (minutes):",{"$f":"IFERROR((MAX(J66:J72,M66:M72,P66:P72,S66:S72)-MIN(J74:S74))*(24*60)/(COUNTIF(K66:T72,TRUE)-1),0)","v":0},null,null,6,null,null,13,null,null,20,null,null,27]
[null,null,null,null,null,null,null,null,7,null,null,14,null,null,21,null,null,28]
[]
[null,null,3.6,"User error",null,null,null,null,null,{"$f":"IF(K66=TRUE,J58,\"\")","v":""},false,null,{"$f":"IF(N66=TRUE,M58,\"\")","v":""},false,null,{"$f":"IF(Q66=TRUE,P58,\"\")","v":""},false,null,{"$f":"IF(T66=TRUE,S58,\"\")","v":""},false]
[null,null,null,null,"Fire went out:",null,null,null,null,{"$f":"IF(K67=TRUE,J59,\"\")","v":""},false,null,{"$f":"IF(N67=TRUE,M59,\"\")","v":""},false,null,{"$f":"IF(Q67=TRUE,P59,\"\")","v":""},false,null,{"$f":"IF(T67=TRUE,S59,\"\")","v":""},false]
[null,null,null,null,"Cook removed functional part(s) of stove:",null,null,null,null,"",false,null,"",false,null,"",false,null,"",false]
[null,null,null,null,"Cook fed too much fuel:",null,null,null,null,"",false,null,"",false,null,"",false,null,"",false]
[null,null,null,null,"Incorrect refueling practices:",null,null,null,null,"",false,null,"",false,null,"",false,null,"",false]
[null,null,null,null,"Incorrect ash cleanout:",null,null,null,null,"",false,null,"",false,null,"",false,null,"",false]
[null,null,null,null,"Other (enter name of error here):",null,null,null,null,"",false,null,"",false,null,"",false,null,"",false]
[null,null,null,null,null,null,null,null,null,"Min times in columns"]
[null,null,3.7,"Visibility of fire",null,{"$f":"IFERROR(_xlfn.IFS(D75=1,3,D75=2,2,D75=3,1,D75=4,0,D75=5,\"\"),\"\")","v":""},null,null,null,{"$f":"IFERROR(SMALL(J66:J72,COUNTIF(J66:J72,0)+1),\"\")","v":""},null,null,{"$f":"IFERROR(SMALL(M66:M72,COUNTIF(M66:M72,0)+1),\"\")","v":""},null,null,{"$f":"IFERROR(SMALL(P66:P72,COUNTIF(P66:P72,0)+1),\"\")","v":""},null,null,{"$f":"IFERROR(SMALL(S66:S72,COUNTIF(S66:S72,0)+1),\"\")","v":""}]
[null,null,null,null,"(3) Best: Highly visible (combustion zone can be seen from a distance from anywhere within the cooking area)",1]
[null,null,null,null,"(2) Good: Moderately visible (combustion zone can be seen from a distance, but from a limited angle or direction, only)"]
[null,null,null,null,"(1) Fair: Minimally visible (cook must bend down within reach of the stove to see combustion zone)"]
[null,null,null,null,"(0) Poor: Combustion zone is never visible while stove is in operation"]
[null,null,null,null," (No measurement taken)"]
[null,null,3.8,"Soot deposited on pot",null,{"$f":"IFERROR(_xlfn.IFS(D81=1,3,D81=2,2,D81=3,1,D81=4,0,D81=5,\"\"),\"\")","v":""}]
[null,null,null,null,"(3) Best: No soot on pot after cooking"]
[null,null,null,null,"(2) Good: Soot covers bottom of pot, only, after cooking"]
[null,null,null,null,"(1) Fair: Soot covers bottom and less than 1/2 of sides of pot after cooking"]
[null,null,null,null,"(0) Poor: Soot covers bottom and more than 1/2 of sides of pot after cooking"]
[null,null,null,null,"(No measurement taken)"]
[null,null,3.9,"Other people present during testing"]
[]
[]
[null,null,3.1,"Other stove model(s) present in household"]
[]
[]
[]
[null,"4. User Survey",4.0999999999999996,"\"How many times do you cook on your stove each day?\""]
[]
[null,null,null,null,"Number of times per day:"]
[]
[null,null,4.2,"\"How often do you buy cooking fuel?”"]
[]
[null,null,null,null,"Interval (number of days, or \"never\"):"]
[]
[null,null,4.3,"“How much cooking fuel do you buy at once? Do you know about how many kilograms it weighs?” "]
[]
[null,null,null,null,"Mass (kg):"]
[]
[null,null,4.4000000000000004,"“How much do you pay each time you buy cooking fuel?”"]
[]
[null,null,null,null,"Currency type:"]
[null,null,null,null,"Amount:"]
[]
[null,null,"4.5 A","“How much time do you or someone who lives in your home spend collecting or buying fuel on average, per day or per week?”"]
[]
[null,null,null,null,"Time spent (hh:mm):"]
[]
[null,null,"Notes:"]
[]
[null,null,"4.5 B","“How do you feel about time spent collecting or buying stove fuel?”"]
[null,null,null,null,"(4) “I enjoy it a lot”",{"$f":"IFERROR(_xlfn.IFS(D117=1,4,D117=2,3,D117=3,2,D117=4,1,D117=5,0,D117=6,\"\"),\"\")","v":""},null,null,null,null,null,null,4]
[null,null,null,null,"(3) “I enjoy it a little”"]
[null,null,null,null,"(2) “I am neutral”"]
[null,null,null,null,"(1) “It is a nuisance”"]
[null,null,null,null,"(0) “It is a serious burden”"]
[null,null,null,null,"(No response recorded)"]
[]
[null,null,4.5999999999999996,"“How enjoyable is spending time cooking, collecting, or buying fuel with other people?” "]
[null,null,null,null,"(N/A) “I don’t do these things with other people” ",{"$f":"IFERROR(_xlfn.IFS(D125=1,\"N/A\",D125=2,4,D125=3,3,D125=4,2,D125=5,1,D125=6,0,D125=7,\"\"),\"\")","v":""},null,0]
[null,null,null,null,"(4) “Very”"]
[null,null,null,null,"(3) “Somewhat”"]
[null,null,null,null,"(2) \"I am neutral\""]
[null,null,null,null,"(1) “Not very”"]
[null,null,null,null,"(0) \"Not at all\""]
[null,null,null,null,"(No response recorded)"]
[]
[null,null,"Notes:"]
[]
[null,null,"4.7 A","“About how much time do you or someone who lives in your home spend cutting, drying, or otherwise preparing fuel each day for your stove?”"]
[]
[null,null,null,null,"Time spent (hh:mm):"]
[]
[null,null,"Notes:"]
[]
[null,null,"4.7 B","“How do you feel about time spent preparing stove fuel?” "]
[null,null,null,null,"(4) “I enjoy it a lot”",{"$f":"IFERROR(_xlfn.IFS(D142=1,4,D142=2,3,D142=3,2,D142=4,1,D142=5,0,D142=6,\"\"),\"\")","v":""}]
[null,null,null,null,"(3) “I enjoy it a little”"]
[null,null,null,null,"(2) \"I am neutral\""]
[null,null,null,null,"(1) “It is a nuisance”"]
[null,null,null,null,"(0) “It is a serious burden”"]
[null,null,null,null,"(No response recorded)"]
[]
[null,null,"4.8 A","“Is it hard or easy to keep the fire small and cook at a low heat on your stove?”"]
[null,null,null,null,"(4) “Very easy”",{"$f":"IFERROR(_xlfn.IFS(D150=1,4,D150=2,3,D150=3,2,D150=4,1,D150=5,0,D150=6,\"\"),\"\")","v":""}]
[null,null,null,null,"(3) “Easy”"]
[null,null,null,null,"(2) “Neither easy nor hard”"]
[null,null,null,null,"(1) “Hard”"]
[null,null,null,null,"(0) “Very hard”"]
[null,null,null,null,"(No response recorded)"]
[]
[null,null,"4.8 B","“How important is it that a stove can easily cook with a small fire or at a low heat?”"]
[null,null,null,null,"(4) “Very important”",{"$f":"IFERROR(_xlfn.IFS(D158=1,4,D158=2,3,D158=3,2,D158=4,1,D158=5,0,D158=6,\"\"),\"\")","v":""}]
[null,null,null,null,"(3) “Important”"]
[null,null,null,null,"(2) “Somewhat important”"]
[null,null,null,null,"(1) “Unimportant”"]
[null,null,null,null,"(0) “Very unimportant”"]
[null,null,null,null,"(No response recorded)"]
[]
[null,null,"Notes:"]
[]
[null,null,"4.9 A","“Is it hard or easy to control the size of the fire in your stove?”"]
[null,null,null,null,"(4) “Very easy”",{"$f":"IFERROR(_xlfn.IFS(D168=1,4,D168=2,3,D168=3,2,D168=4,1,D168=5,0,D168=6,\"\"),\"\")","v":""}]
[null,null,null,null,"(3) “Easy”"]
[null,null,null,null,"(2) “Neither easy nor hard”"]
[null,null,null,null,"(1) “Hard”"]
[null,null,null,null,"(0) “Very hard”"]
[null,null,null,null,"(No response recorded)"]
[]
[null,null,"4.9 B","“How important is it that the size of the fire can be adjusted easily?”"]
[null,null,null,null,"(4) “Very important”",{"$f":"IFERROR(_xlfn.IFS(D176=1,4,D176=2,3,D176=3,2,D176=4,1,D176=5,0,D176=6,\"\"),\"\")","v":""}]
[null,null,null,null,"(3) “Important”"]
[null,null,null,null,"(2) “Somewhat important”"]
[null,null,null,null,"(1) “Unimportant”"]
[null,null,null,null,"(0) “Very unimportant”"]
[null,null,null,null,"(No response recorded)"]
[]
[null,null,"Notes:"]
[]
[null,null,"4.10 A","“How do you feel about the frequency with which your stove needs to be tended?”"]
[null,null,null,null,"(4) “I really like how little tending it needs. I wouldn’t change it.”",{"$f":"IFERROR(_xlfn.IFS(D186=1,4,D186=2,3,D186=3,2,D186=4,1,D186=5,0,D186=6,\"\"),\"\")","v":""}]
[null,null,null,null,"(3) “I like how little tending it needs, but wish it needed less”"]
[null,null,null,null,"(2) “I am neutral”"]
[null,null,null,null,"(1) “I don’t like how much tending it needs”"]
[null,null,null,null,"(0) “I dislike it so much that I don’t like to cook with it.”"]
[null,null,null,null,"(No response recorded)"]
[]
[null,null,"4.10 B","“How important is it that your stove can be left without being tended for a long time?"]
[null,null,null,null,"(4) “Very important”",{"$f":"IFERROR(_xlfn.IFS(D194=1,4,D194=2,3,D194=3,2,D194=4,1,D194=5,0,D194=6,\"\"),\"\")","v":""}]
[null,null,null,null,"(3) “Important”"]
[null,null,null,null,"(2) “Somewhat important”"]
[null,null,null,null,"(1) “Unimportant”"]
[null,null,null,null,"(0) “Very unimportant”"]
[null,null,null,null,"(No response recorded)"]
[]
[null,null,"Notes:"]
[]
[null,null,"4.11 A","“Does your stove cook quickly or slowly?”"]
[null,null,null,null,"(4) “Very quickly”",{"$f":"IFERROR(_xlfn.IFS(D204=1,4,D204=2,3,D204=3,2,D204=4,1,D204=5,0,D204=6,\"\"),\"\")","v":""}]
[null,null,null,null,"(3) “Quickly”"]
[null,null,null,null,"(2) “Neither quickly nor slowly”"]
[null,null,null,null,"(1) “Slowly”"]
[null,null,null,null,"(0) “Very slowly”"]
[null,null,null,null,"(No response recorded)"]
[]
[null,null,"4.11 B","“How important is it that a stove cook quickly?”"]
[null,null,null,null,"(4) “Very important”",{"$f":"IFERROR(_xlfn.IFS(D212=1,4,D212=2,3,D212=3,2,D212=4,1,D212=5,0,D212=6,\"\"),\"\")","v":""}]
[null,null,null,null,"(3) “Important”"]
[null,null,null,null,"(2) “Somewhat important”"]
[null,null,null,null,"(1) “Unimportant”"]
[null,null,null,null,"(0) “Very unimportant”"]
[null,null,null,null,"(No response recorded)"]
[]
[null,null,"Notes:"]
[]
[null,null,"4.12 A","“How many of the different sizes of pots and pans you cook with fit on your stove?” "]
[null,null,null,null,"(4) “All”",{"$f":"IFERROR(_xlfn.IFS(D222=1,4,D222=2,3,D222=3,2,D222=4,1,D222=5,0,D222=6,\"\"),\"\")","v":""}]
[null,null,null,null,"(3) “More than half”"]
[null,null,null,null,"(2) “About half"]
[null,null,null,null,"(1) “Less than half”"]
[null,null,null,null,"(0) “None”"]
[null,null,null,null,"(No response recorded)"]
[]
[null,null,"4.12 B","“How important is it that a stove can cook with all of the sizes of  pots and pans you normally use?”"]
[null,null,null,null,"(4) “Very important”",{"$f":"IFERROR(_xlfn.IFS(D230=1,4,D230=2,3,D230=3,2,D230=4,1,D230=5,0,D230=6,\"\"),\"\")","v":""}]
[null,null,null,null,"(3) “Important”"]
[null,null,null,null,"(2) “Somewhat important”"]
[null,null,null,null,"(1) “Unimportant”"]
[null,null,null,null,"(0) “Very unimportant”"]
[null,null,null,null,"(No response recorded)"]
[]
[null,null,"Notes:"]
[]
[null,null,4.13,"\"How many different dishes do you usually cook at the same time during the main meal of the day?\""]
[null,null,null,null,"Number of dishes"]
[]
[null,null,"Notes:"]
[]
[null,null,"4.14 A","“Are any of the following true for you when you reload fuel or tend the fire in your stove?”"]
[null,null,null,false,"“I have to remove the pot”",{"$f":"IF(D248=FALSE,(COUNTIF(D245:D247,FALSE)),\"\")","v":""}]
[null,null,null,false,"“I am exposed to a lot of heat or sometimes burn myself”"]
[null,null,null,false,"“I am exposed to a lot of smoke”"]
[null,null,null,true,"(No response recorded)"]
[]
[null,null,"4.14 B","“How important is it that it is easy to reload and tend a stove?”"]
[null,null,null,null,"(4) “Very important”",{"$f":"IFERROR(_xlfn.IFS(D251=1,4,D251=2,3,D251=3,2,D251=4,1,D251=5,0,D251=6,\"\"),\"\")","v":""}]
[null,null,null,null,"(3) “Important”"]
[null,null,null,null,"(2) “Somewhat important”"]
[null,null,null,null,"(1) “Unimportant”"]
[null,null,null,null,"(0) “Very unimportant”"]
[null,null,null,null,"(No response recorded)"]
[]
[null,null,"Notes:"]
[]
[null,null,"4.15 A","“About how many minutes does it take for the fire to get hot enough to start cooking after you light it?"]
[null,null,null,null,"Time (minutes):"]
[]
[null,null,"4.15 B","“How important is it that a stove gets hot enough to cook on quickly?”"]
[null,null,null,null,"(4) “Very important”",{"$f":"IFERROR(_xlfn.IFS(D264=1,4,D264=2,3,D264=3,2,D264=4,1,D264=5,0,D264=6,\"\"),\"\")","v":""}]
[null,null,null,null,"(3) “Important”"]
[null,null,null,null,"(2) “Somewhat important”"]
[null,null,null,null,"(1) “Unimportant”"]
[null,null,null,null,"(0) “Very unimportant”"]
[null,null,null,null,"(No response recorded)"]
[]
[null,null,"Notes:"]
[]
[null,null,"4.16 A","“Do you routinely fix or maintain your stove? If so, how often?”"]
[null,null,null,null,"Interval (number of days, or \"never\"):"]
[]
[null,null,"4.16 B","“Do you agree or disagree that the routine maintenance of a stove is an important concern?”"]
[null,null,null,null,"(4) “Very important”",{"$f":"IFERROR(_xlfn.IFS(D277=1,4,D277=2,3,D277=3,2,D277=4,1,D277=5,0,D277=6,\"\"),\"\")","v":""}]
[null,null,null,null,"(3) “Important”"]
[null,null,null,null,"(2) “Somewhat important”"]
[null,null,null,null,"(1) “Unimportant”"]
[null,null,null,null,"(0) “Very unimportant”"]
[null,null,null,null,"(No response recorded)"]
[]
[null,null,"Notes:"]
[]
[null,null,"4.17 A","“Are any of the following true about the maintenance requirements of your stove?”"]
[null,null,null,false,"“It requires purchased replacement parts once a year or more”",{"$f":"IF(D290=FALSE,(COUNTIF(D287:D289,FALSE)),\"\")","v":""}]
[null,null,null,false,"“Necessary replacement parts are not available or hard to find”"]
[null,null,null,false,"“Necessary replacement parts are too expensive”"]
[null,null,null,true,"(No response recorded)"]
[null,null,null,null,null,"If parts are required, how much do they cost per year?"]
[null,null,null,null," Currency type:"]
[null,null,null,null,"Amount:"]
[]
[null,null,"4.17 B","“Do you agree or disagree that the long-term maintenance of a stove is an important concern?” "]
[null,null,null,null,"(4) “Very important”",{"$f":"IFERROR(_xlfn.IFS(D296=1,4,D296=2,3,D296=3,2,D296=4,1,D296=5,0,D296=6,\"\"),\"\")","v":""}]
[null,null,null,null,"(3) “Important”"]
[null,null,null,null,"(2) “Somewhat important”"]
[null,null,null,null,"(1) “Unimportant”"]
[null,null,null,null,"(0) “Very unimportant”"]
[null,null,null,null,"(No response recorded)"]
[]
[null,null,"Notes:"]
[]
[null,null,"4.18 A","\"Which of the following best describes how you feel about the safety of your stove?\""]
[null,null,null,null,"(4) \"It stove feels very safe to use\"",{"$f":"IFERROR(_xlfn.IFS(D306=1,4,D306=2,3,D306=3,2,D306=4,1,D306=5,0,D306=6,\"\"),\"\")","v":""}]
[null,null,null,null,"(3) \"It generally feels safe to use, but sometimes feels unsafe\""]
[null,null,null,null,"(2) “It is neither safe nor unsafe”"]
[null,null,null,null,"(1) \"It is not very safe to use\""]
[null,null,null,null,"(0) \"It is so unsafe that I do not want to use it\""]
[null,null,null,null,"(No response recorded)"]
[]
[null,null,"4.18 B","“How important is the safety of a stove?”"]
[null,null,null,null,"(4) “Very important”",{"$f":"IFERROR(_xlfn.IFS(D314=1,4,D314=2,3,D314=3,2,D314=4,1,D314=5,0,D314=6,\"\"),\"\")","v":""}]
[null,null,null,null,"(3) “Important”"]
[null,null,null,null,"(2) “Somewhat important”"]
[null,null,null,null,"(1) “Unimportant”"]
[null,null,null,null,"(0) “Very unimportant”"]
[null,null,null,null,"(No response recorded)"]
[]
[null,null,"Notes:"]
[]
[null,null,"4.19 A","\"Which of the following best describes the amount of smoke your stove creates in the area where you cook?\""]
[null,null,null,null,"(4) “The stove produces no smoke”",{"$f":"IFERROR(_xlfn.IFS(D324=1,4,D324=2,3,D324=3,2,D324=4,1,D324=5,0,D324=6,\"\"),\"\")","v":""}]
[null,null,null,null,"(3) “I like how little smoke there is”"]
[null,null,null,null,"(2) “I am neutral”"]
[null,null,null,null,"(1) \"I don't like the amount of smoke \""]
[null,null,null,null,"(0) \"There is so much smoke that I don't like to use this stove\""]
[null,null,null,null,"(No response recorded)"]
[]
[null,null,"4.19 B","“Is smoke in the cooking area an important concern to you?”"]
[null,null,null,null,"(4) “Very important”",{"$f":"IFERROR(_xlfn.IFS(D332=1,4,D332=2,3,D332=3,2,D332=4,1,D332=5,0,D332=6,\"\"),\"\")","v":""}]
[null,null,null,null,"(3) “Important”"]
[null,null,null,null,"(2) “Somewhat important”"]
[null,null,null,null,"(1) “Unimportant”"]
[null,null,null,null,"(0) “Very unimportant”"]
[null,null,null,null,"(No response recorded)"]
[]
[null,null,"Notes:"]
[]
[null,null,"4.20 A","\"Which of the following best describes how you feel about the height of this stove above the ground?\""]
[null,null,null,null,"(4) \"The height is perfect. I wouldn't change it\"",{"$f":"IFERROR(_xlfn.IFS(D342=1,4,D342=2,3,D342=3,2,D342=4,1,D342=5,0,D342=6,\"\"),\"\")","v":""}]
[null,null,null,null,"(3) \"The height is comfortable, but not perfect\""]
[null,null,null,null,"(2) “I am neutral”"]
[null,null,null,null,"(1) “The height makes it somewhat uncomfortable to use”"]
[null,null,null,null,"(0) “The height makes it is so uncomfortable that I don’t like using it”"]
[null,null,null,null,"(No response recorded)"]
[]
[null,null,"4.20 B","“How important is the height of a stove?”"]
[null,null,null,null,"(4) “Very important”",{"$f":"IFERROR(_xlfn.IFS(D350=1,4,D350=2,3,D350=3,2,D350=4,1,D350=5,0,D350=6,\"\"),\"\")","v":""}]
[null,null,null,null,"(3) “Important”"]
[null,null,null,null,"(2) “Somewhat important”"]
[null,null,null,null,"(1) “Unimportant”"]
[null,null,null,null,"(0) “Very unimportant”"]
[null,null,null,null,"(No response recorded)"]
[]
[null,null,"Notes:"]
[]
[null,null,"4.21 A","\"Which of the following best describes how you feel about the appearance of this stove?\""]
[null,null,null,null,"(4) \"I really like the way it looks. I would not change it\"",{"$f":"IFERROR(_xlfn.IFS(D360=1,4,D360=2,3,D360=3,2,D360=4,1,D360=5,0,D360=6,\"\"),\"\")","v":""}]
[null,null,null,null,"(3) \"It looks good, but could look better\""]
[null,null,null,null,"(2) “I am neutral”"]
[null,null,null,null,"(1) \"It does not look very attractive. I wish it was different”"]
[null,null,null,null,"(0) \"It is so ugly that I do not like having it in my house\""]
[null,null,null,null,"(No response recorded)"]
[]
[null,null,"4.21 B","“How important is the appearance of a stove?”"]
[null,null,null,null,"(4) “Very important”",{"$f":"IFERROR(_xlfn.IFS(D368=1,4,D368=2,3,D368=3,2,D368=4,1,D368=5,0,D368=6,\"\"),\"\")","v":""}]
[null,null,null,null,"(3) “Important”"]
[null,null,null,null,"(2) “Somewhat important”"]
[null,null,null,null,"(1) “Unimportant”"]
[null,null,null,null,"(0) “Very unimportant”"]
[null,null,null,null,"(No response recorded)"]
[]
[null,null,"Notes:"]
[]
[null,null,"4.22 A","\"Which of the following best describes how you feel about the durability of this stove?\""]
[null,null,null,null,"(4) \"It is very durable\"",{"$f":"IFERROR(_xlfn.IFS(D378=1,4,D378=2,3,D378=3,2,D378=4,1,D378=5,0,D378=6,\"\"),\"\")","v":""}]
[null,null,null,null,"(3) “It is somewhat durable”"]
[null,null,null,null,"(2) “I am neutral”"]
[null,null,null,null,"(1) \"It is not very durable\""]
[null,null,null,null,"(0) \"The durability is so poor that it is not worth using\""]
[null,null,null,null,"(No response recorded)"]
[]
[null,null,"4.22 B","“How important is the durability of a stove?”"]
[null,null,null,null,"(4) “Very important”",{"$f":"IFERROR(_xlfn.IFS(D386=1,4,D386=2,3,D386=3,2,D386=4,1,D386=5,0,D386=6,\"\"),\"\")","v":""}]
[null,null,null,null,"(3) “Important”"]
[null,null,null,null,"(2) “Somewhat important”"]
[null,null,null,null,"(1) “Unimportant”"]
[null,null,null,null,"(0) “Very unimportant”"]
[null,null,null,null,"(No response recorded)"]
[]
[null,null,"Notes:"]
[]
[null,null,"4.23 A","\"Which of the following best describes how you feel about the value of this stove?\""]
[null,null,null,null,"(4) \"It is a very good value for the cost\"",{"$f":"IFERROR(_xlfn.IFS(D396=1,4,D396=2,3,D396=3,2,D396=4,1,D396=5,0,D396=6,\"\"),\"\")","v":""}]
[null,null,null,null,"(3) \"It is a good value for the cost\""]
[null,null,null,null,"(2) “I am neutral”"]
[null,null,null,null,"(1) \"It is not a very good value for the cost\""]
[null,null,null,null,"(0) \"It is a bad value for the cost\""]
[null,null,null,null,"(No response recorded)"]
[]
[null,null,"4.23 B","“How important is the value of a stove in your decision to use it?”"]
[null,null,null,null,"(4) “Very important”",{"$f":"IFERROR(_xlfn.IFS(D404=1,4,D404=2,3,D404=3,2,D404=4,1,D404=5,0,D404=6,\"\"),\"\")","v":""}]
[null,null,null,null,"(3) “Important”"]
[null,null,null,null,"(2) “Neither important nor unimportant”"]
[null,null,null,null,"(1) “Unimportant”"]
[null,null,null,null,"(0) “Very unimportant”"]
[null,null,null,null,"(No response recorded)"]
[]
[null,null,"Notes:"]
[]
[null,null,4.24,"Location-specifc needs"]
[null,null,null,null,null,null,null,null,"Important feature?",null,"Need met by stove?"]
[null,null,null,1,"Space heating",{"$f":"IF(OR(ISBLANK(I415),I415=\"no\"),\"N/A\",IF(AND(I415=\"yes\",K415=\"no\"),\"Fail\",\"Pass\"))","v":"N/A"}]
[null,null,null,2,"Insect repellent",{"$f":"IF(OR(ISBLANK(I416),I416=\"no\"),\"N/A\",IF(AND(I416=\"yes\",K416=\"no\"),\"Fail\",\"Pass\"))","v":"N/A"}]
[null,null,null,3,"Lighting","N/A"]
[null,null,null,4,"Portability","N/A"]
[null,null,null,5,"Water heating","N/A"]
[null,null,null,6,"Food drying or smoking","N/A"]
[null,null,null,7,"Other: [enter]","N/A"]
[null,null,null,8,"Other: [enter]","N/A"]
[]
[null,null,"4.25 A","\"Does this stove make the flavor or taste of your food better or worse than other stoves?”"]
[null,null,null,null,"(4) “Much better”",{"$f":"IFERROR(_xlfn.IFS(D425=1,4,D425=2,3,D425=3,2,D425=4,1,D425=5,0,D425=6,\"\"),\"\")","v":""}]
[null,null,null,null,"(3) “A little better”"]
[null,null,null,null,"(2) “Neither better nor worse”"]
[null,null,null,null,"(1) “A little worse”"]
[null,null,null,null,"(0) “Much worse”"]
[null,null,null,null,"(No response recorded)"]
[]
[null,null,"4.25 B","“How important is the flavor or taste added by a stove?”"]
[null,null,null,null,"(4) “Very important”",{"$f":"IFERROR(_xlfn.IFS(D433=1,4,D433=2,3,D433=3,2,D433=4,1,D433=5,0,D433=6,\"\"),\"\")","v":""}]
[null,null,null,null,"(3) “Important”"]
[null,null,null,null,"(2) “Somewhat important”"]
[null,null,null,null,"(1) “Unimportant”"]
[null,null,null,null,"(0) “Very unimportant”"]
[null,null,null,null,"(No response recorded)"]
[]
[null,null,"Notes:"]
[]
[null,null,4.2599999999999971,"“How long have you been using this particular kind of stove” "]
[null,null,null,null,"Duration:"]
[null,null,null,null,"Unit of time (days, weeks, months, or years):"]
[]
[null,null,"Notes:"]
[]
[null,null,4.2699999999999996,"“Did your stove come with a paper instruction manual, or were you trained how to use your cookstove?”"]
[null,null,null,null,"(4) Yes, and it was good enough",{"$f":"IFERROR(_xlfn.IFS(D449=1,4,D449=2,2,D449=3,0,D449=4,\"\"),\"\")","v":""}]
[null,null,null,null,"(2) Yes, but it was not good enough"]
[null,null,null,null,"(0) No"]
[null,null,null,null,"(No response recorded)"]
[]
[null,null,"Notes:",null,null,null,null,null,null,"Interview Coding"]
[null,null,null,null,null,null,null,null,null,"Select or enter up to four main themes or concepts from each question response in the cells, below. Use the same code for closely related ideas for best results.                                             A few examples are provided."]
[]
[null,"5. Semi-Structured Interview",5.0999999999999996,"\"Can you list a few of your favorite things about your stove? Why are they important to you?\""]
[]
[]
[null,null,5.2,"\"Can you list a few of your least favorite things about your stove? Why are they important to you?\""]
[]
[]
[null,null,5.3,"“Is there anything you would like to change about your stove?”"]
[]
[]
[null,null,5.4,"\"Is there anything else you would like to tell me about your stove or cooking in general?\""]
[]
[]
[null,null,5.5,"Additional question(s) and response(s). "]

{"sheet":"Test 1","index":5,"n_rows":469,"n_cols":20,"rows_kept":469,"cut":false,"hidden":false,"merged":[[469,9,469,10],[469,12,469,13],[469,15,469,16],[469,18,469,19],[465,3,465,5],[466,3,466,5],[466,9,466,10],[466,12,466,13],[466,15,466,16],[466,18,466,19],[453,3,453,5],[453,9,453,19],[454,9,456,19],[456,1,470,1],[456,3,456,5],[457,3,457,5],[457,9,457,10],[457,12,457,13],[457,15,457,16],[457,18,457,19],[462,3,462,5],[463,3,463,5],[463,9,463,10],[463,12,463,13],[463,15,463,16],[463,18,463,19],[459,3,459,5],[460,3,460,5],[460,9,460,10],[460,12,460,13],[460,15,460,16],[460,18,460,19],[468,3,468,5],[469,3,469,5],[423,3,423,5],[431,3,431,5],[439,3,439,5],[441,3,441,5],[445,3,445,5],[447,3,447,5],[416,8,416,9],[417,8,417,9],[418,8,418,9],[419,8,419,9],[420,8,420,9],[421,8,421,9],[402,3,402,5],[410,3,410,5],[412,3,412,5],[413,8,413,9],[414,8,414,9],[415,8,415,9],[366,3,366,5],[374,3,374,5],[376,3,376,5],[384,3,384,5],[392,3,392,5],[394,3,394,5],[340,3,340,5],[348,3,348,5],[356,3,356,5],[358,3,358,5],[294,3,294,5],[302,3,302,5],[304,3,304,5],[312,3,312,5],[320,3,320,5],[322,3,322,5],[285,3,285,5],[238,3,238,5],[241,3,241,5],[243,3,243,5],[249,3,249,5],[257,3,257,5],[259,3,259,5],[330,3,330,5],[338,3,338,5],[182,3,182,5],[184,3,184,5],[192,3,192,5],[200,3,200,5],[262,3,262,5],[270,3,270,5],[272,3,272,5],[275,3,275,5],[283,3,283,5],[134,3,134,5],[138,3,138,5],[140,3,140,5],[148,3,148,5],[156,3,156,5],[164,3,164,5],[92,1,454,1],[92,3,92,5],[96,3,96,5],[100,3,100,5],[104,3,104,5],[109,3,109,5],[113,3,113,5],[115,3,115,5],[123,3,123,5],[132,3,132,5],[202,3,202,5],[210,3,210,5],[218,3,218,5],[220,3,220,5],[228,3,228,5],[236,3,236,5],[166,3,166,5],[174,3,174,5],[55,15,56,15],[55,16,56,16],[55,18,56,18],[55,19,56,19],[86,3,86,5],[89,3,89,5],[14,1,32,1],[34,1,90,1],[55,9,56,9],[55,10,56,10],[55,12,56,12],[55,13,56,13],[1,8,1,9],[6,1,12,1],[6,3,6,4],[6,5,6,9],[7,3,7,4],[7,5,7,9],[10,3,10,4],[10,5,10,9],[10,14,10,15],[11,3,11,4],[11,5,11,9],[11,14,11,15],[12,3,12,4],[12,5,12,9],[12,14,12,15],[7,14,7,15],[8,3,8,4],[8,5,8,9],[8,14,8,15],[9,3,9,4],[9,5,9,9],[9,14,9,15]]}
[]
[null,"Data Entry Form\n",null,null,null,null,"Test Number:"]
[]
[null,"Enter test data in grey cells"]
[null,"Blue cells are calculated automatically"]
[]
[null,"1. Participant ID",1.1000000000000001,"Date"]
[null,null,1.2,"Time of visit"]
[null,null,1.3,"Study region"]
[null,null,1.4,"Household name or ID number "]
[null,null,1.5,"Name of main cook "]
[null,null,1.6,"Test Administrator name(s) or ID number(s)"]
[null,null,1.7,"Stove model(s) used during cooking evaluation"]
[]
[null,"2. Cookstove Characteristics Evaluation",2.1,"Ease of lighting"]
[null,null,null,null,"Kindling or accelerants are required:"]
[null,null,null,null,"Fire must be lit in an enclosed space within the stove:"]
[]
[null,null,2.2000000000000002,"Fuel feed entry or loading area size "]
[null,null,null,null,"Three stone fire/unrestricted fuel feed:"]
[null,null,null,null,null,"IF NO:"]
[null,null,null,null,"Width (cm):"]
[null,null,null,null,"Height (cm):"]
[null,null,null,null,null,"OR"]
[null,null,null,null,"Diameter (cm):"]
[]
[null,null,2.2999999999999998,"Indoor soot evaluation"]
[null,null,null,null,"Gas, alcohol, or electric power:"]
[null,null,null,null,"Sealed chimney:"]
[]
[null,null,2.4,"Burner count"]
[null,null,null,null,"Number of burners (or \"plancha\"):"]
[]
[]
[null,"3. User Cooking Event Observation",3.1,"Fuel preparation"]
[null,null,null,null,"Start time (hh:mm):"]
[null,null,null,null,"Completion time (hh:mm):"]
[null,null,null,null,"Specialized knowledge or tools required for fuel preparation:"]
[]
[null,null,3.2,"Lighting time required"]
[null,null,null,null,"Start time (hh:mm):"]
[null,null,null,null,"Completion time (hh:mm):"]
[]
[null,null,3.3,"Fuel consumption "]
[null,null,null,null,"Initial mass (kg)"]
[null,null,null,null,"Final mass (kg)"]
[]
[null,null,null,null,"Total fuel consumption (kg)",{"$f":"IF(F46-F45<0,F45-F46,0)","v":0}]
[]
[null,null,3.4,"Cooking time"]
[null,null,null,null,"Start time (hh:mm):"]
[null,null,null,null,"Completion time (hh:mm):"]
[]
[null,null,null,null,"Cooking duration (hh:mm):",{"$f":"IF(F52-F51>0,F52-F51,0)","v":"00:00:00"},null,null,null,"Min times in columns"]
[null,null,null,null,null,null,null,null,null,{"$f":"IFERROR(SMALL(J58:J64,COUNTIF(J58:J64,0)+1),\"\")","v":""},null,null,{"$f":"IFERROR(SMALL(M58:M64,COUNTIF(M58:M64,0)+1),\"\")","v":""},null,null,{"$f":"IFERROR(SMALL(P58:P64,COUNTIF(P58:P64,0)+1),\"\")","v":""},null,null,{"$f":"IFERROR(SMALL(S58:S64,COUNTIF(S58:S64,0)+1),\"\")","v":""}]
[null,null,3.5,"Tending and refueling frequency",null,null,null,null,null,"Time tended","Stove refueled?",null,"Time tended","Stove refueled?",null,"Time tended","Stove refueled?",null,"Time tended","Stove refueled?"]
[null,null,null,"Enter the time of each tending event in the cells at right."]
[null,null,null,"Check the box next to the cell if the stove was also refueled.",null,null,null,null,1,null,null,8,null,null,15,null,null,22]
[null,null,null,null,null,null,null,null,2,null,null,9,null,null,16,null,null,23]
[null,null,null,null,null,null,null,null,3,null,null,10,null,null,17,null,null,24]
[null,null,null,null,null,null,null,null,4,null,null,11,null,null,18,null,null,25]
[null,null,null,null,"Average tending interval (minutes):",{"$f":"IFERROR((MAX(J58:J64,M58:M64,P58:P64,S58:S64)-MIN(J55:S55))*(24*60)/(COUNTA(J58:J64,M58:M64,P58:P64,S58:S64)-1),\"\")","v":0},null,null,5,null,null,12,null,null,19,null,null,26]
[null,null,null,null,"Average refueling interval (minutes):",{"$f":"IFERROR((MAX(J66:J72,M66:M72,P66:P72,S66:S72)-MIN(J74:S74))*(24*60)/(COUNTIF(K66:T72,TRUE)-1),0)","v":0},null,null,6,null,null,13,null,null,20,null,null,27]
[null,null,null,null,null,null,null,null,7,null,null,14,null,null,21,null,null,28]
[]
[null,null,3.6,"User error",null,null,null,null,null,{"$f":"IF(K66=TRUE,J58,\"\")","v":""},false,null,{"$f":"IF(N66=TRUE,M58,\"\")","v":""},false,null,{"$f":"IF(Q66=TRUE,P58,\"\")","v":""},false,null,{"$f":"IF(T66=TRUE,S58,\"\")","v":""},false]
[null,null,null,null,"Fire went out:",null,null,null,null,{"$f":"IF(K67=TRUE,J59,\"\")","v":""},false,null,{"$f":"IF(N67=TRUE,M59,\"\")","v":""},false,null,{"$f":"IF(Q67=TRUE,P59,\"\")","v":""},false,null,{"$f":"IF(T67=TRUE,S59,\"\")","v":""},false]
[null,null,null,null,"Cook removed functional part(s) of stove:",null,null,null,null,"",false,null,"",false,null,"",false,null,"",false]
[null,null,null,null,"Cook fed too much fuel:",null,null,null,null,"",false,null,"",false,null,"",false,null,"",false]
[null,null,null,null,"Incorrect refueling practices:",null,null,null,null,"",false,null,"",false,null,"",false,null,"",false]
[null,null,null,null,"Incorrect ash cleanout:",null,null,null,null,"",false,null,"",false,null,"",false,null,"",false]
[null,null,null,null,"Other (enter name of error here):",null,null,null,null,"",false,null,"",false,null,"",false,null,"",false]
[null,null,null,null,null,null,null,null,null,"Min times in columns"]
[null,null,3.7,"Visibility of fire",null,{"$f":"IFERROR(_xlfn.IFS(D75=1,3,D75=2,2,D75=3,1,D75=4,0,D75=5,\"\"),\"\")","v":""},null,null,null,{"$f":"IFERROR(SMALL(J66:J72,COUNTIF(J66:J72,0)+1),\"\")","v":""},null,null,{"$f":"IFERROR(SMALL(M66:M72,COUNTIF(M66:M72,0)+1),\"\")","v":""},null,null,{"$f":"IFERROR(SMALL(P66:P72,COUNTIF(P66:P72,0)+1),\"\")","v":""},null,null,{"$f":"IFERROR(SMALL(S66:S72,COUNTIF(S66:S72,0)+1),\"\")","v":""}]
[null,null,null,null,"(3) Best: Highly visible (combustion zone can be seen from a distance from anywhere within the cooking area)",1]
[null,null,null,null,"(2) Good: Moderately visible (combustion zone can be seen from a distance, but from a limited angle or direction, only)"]
[null,null,null,null,"(1) Fair: Minimally visible (cook must bend down within reach of the stove to see combustion zone)"]
[null,null,null,null,"(0) Poor: Combustion zone is never visible while stove is in operation"]
[null,null,null,null," (No measurement taken)"]
[null,null,3.8,"Soot deposited on pot",null,{"$f":"IFERROR(_xlfn.IFS(D81=1,3,D81=2,2,D81=3,1,D81=4,0,D81=5,\"\"),\"\")","v":""}]
[null,null,null,null,"(3) Best: No soot on pot after cooking"]
[null,null,null,null,"(2) Good: Soot covers bottom of pot, only, after cooking"]
[null,null,null,null,"(1) Fair: Soot covers bottom and less than 1/2 of sides of pot after cooking"]
[null,null,null,null,"(0) Poor: Soot covers bottom and more than 1/2 of sides of pot after cooking"]
[null,null,null,null,"(No measurement taken)"]
[null,null,3.9,"Other people present during testing"]
[]
[]
[null,null,3.1,"Other stove model(s) present in household"]
[]
[]
[]
[null,"4. User Survey",4.0999999999999996,"\"How many times do you cook on your stove each day?\""]
[]
[null,null,null,null,"Number of times per day:"]
[]
[null,null,4.2,"\"How often do you buy cooking fuel?”"]
[]
[null,null,null,null,"Interval (number of days, or \"never\"):"]
[]
[null,null,4.3,"“How much cooking fuel do you buy at once? Do you know about how many kilograms it weighs?” "]
[]
[null,null,null,null,"Mass (kg):"]
[]
[null,null,4.4000000000000004,"“How much do you pay each time you buy cooking fuel?”"]
[]
[null,null,null,null,"Currency type:"]
[null,null,null,null,"Amount:"]
[]
[null,null,"4.5 A","“How much time do you or someone who lives in your home spend collecting or buying fuel on average, per day or per week?”"]
[]
[null,null,null,null,"Time spent (hh:mm):"]
[]
[null,null,"Notes:"]
[]
[null,null,"4.5 B","“How do you feel about time spent collecting or buying stove fuel?”"]
[null,null,null,null,"(4) “I enjoy it a lot”",{"$f":"IFERROR(_xlfn.IFS(D117=1,4,D117=2,3,D117=3,2,D117=4,1,D117=5,0,D117=6,\"\"),\"\")","v":""},null,null,null,null,null,null,4]
[null,null,null,null,"(3) “I enjoy it a little”"]
[null,null,null,null,"(2) “I am neutral”"]
[null,null,null,null,"(1) “It is a nuisance”"]
[null,null,null,null,"(0) “It is a serious burden”"]
[null,null,null,null,"(No response recorded)"]
[]
[null,null,4.5999999999999996,"“How enjoyable is spending time cooking, collecting, or buying fuel with other people?” "]
[null,null,null,null,"(N/A) “I don’t do these things with other people” ",{"$f":"IFERROR(_xlfn.IFS(D125=1,\"N/A\",D125=2,4,D125=3,3,D125=4,2,D125=5,1,D125=6,0,D125=7,\"\"),\"\")","v":""},null,0]
[null,null,null,null,"(4) “Very”"]
[null,null,null,null,"(3) “Somewhat”"]
[null,null,null,null,"(2) \"I am neutral\""]
[null,null,null,null,"(1) “Not very”"]
[null,null,null,null,"(0) \"Not at all\""]
[null,null,null,null,"(No response recorded)"]
[]
[null,null,"Notes:"]
[]
[null,null,"4.7 A","“About how much time do you or someone who lives in your home spend cutting, drying, or otherwise preparing fuel each day for your stove?”"]
[]
[null,null,null,null,"Time spent (hh:mm):"]
[]
[null,null,"Notes:"]
[]
[null,null,"4.7 B","“How do you feel about time spent preparing stove fuel?” "]
[null,null,null,null,"(4) “I enjoy it a lot”",{"$f":"IFERROR(_xlfn.IFS(D142=1,4,D142=2,3,D142=3,2,D142=4,1,D142=5,0,D142=6,\"\"),\"\")","v":""}]
[null,null,null,null,"(3) “I enjoy it a little”"]
[null,null,null,null,"(2) \"I am neutral\""]
[null,null,null,null,"(1) “It is a nuisance”"]
[null,null,null,null,"(0) “It is a serious burden”"]
[null,null,null,null,"(No response recorded)"]
[]
[null,null,"4.8 A","“Is it hard or easy to keep the fire small and cook at a low heat on your stove?”"]
[null,null,null,null,"(4) “Very easy”",{"$f":"IFERROR(_xlfn.IFS(D150=1,4,D150=2,3,D150=3,2,D150=4,1,D150=5,0,D150=6,\"\"),\"\")","v":""}]
[null,null,null,null,"(3) “Easy”"]
[null,null,null,null,"(2) “Neither easy nor hard”"]
[null,null,null,null,"(1) “Hard”"]
[null,null,null,null,"(0) “Very hard”"]
[null,null,null,null,"(No response recorded)"]
[]
[null,null,"4.8 B","“How important is it that a stove can easily cook with a small fire or at a low heat?”"]
[null,null,null,null,"(4) “Very important”",{"$f":"IFERROR(_xlfn.IFS(D158=1,4,D158=2,3,D158=3,2,D158=4,1,D158=5,0,D158=6,\"\"),\"\")","v":""}]
[null,null,null,null,"(3) “Important”"]
[null,null,null,null,"(2) “Somewhat important”"]
[null,null,null,null,"(1) “Unimportant”"]
[null,null,null,null,"(0) “Very unimportant”"]
[null,null,null,null,"(No response recorded)"]
[]
[null,null,"Notes:"]
[]
[null,null,"4.9 A","“Is it hard or easy to control the size of the fire in your stove?”"]
[null,null,null,null,"(4) “Very easy”",{"$f":"IFERROR(_xlfn.IFS(D168=1,4,D168=2,3,D168=3,2,D168=4,1,D168=5,0,D168=6,\"\"),\"\")","v":""}]
[null,null,null,null,"(3) “Easy”"]
[null,null,null,null,"(2) “Neither easy nor hard”"]
[null,null,null,null,"(1) “Hard”"]
[null,null,null,null,"(0) “Very hard”"]
[null,null,null,null,"(No response recorded)"]
[]
[null,null,"4.9 B","“How important is it that the size of the fire can be adjusted easily?”"]
[null,null,null,null,"(4) “Very important”",{"$f":"IFERROR(_xlfn.IFS(D176=1,4,D176=2,3,D176=3,2,D176=4,1,D176=5,0,D176=6,\"\"),\"\")","v":""}]
[null,null,null,null,"(3) “Important”"]
[null,null,null,null,"(2) “Somewhat important”"]
[null,null,null,null,"(1) “Unimportant”"]
[null,null,null,null,"(0) “Very unimportant”"]
[null,null,null,null,"(No response recorded)"]
[]
[null,null,"Notes:"]
[]
[null,null,"4.10 A","“How do you feel about the frequency with which your stove needs to be tended?”"]
[null,null,null,null,"(4) “I really like how little tending it needs. I wouldn’t change it.”",{"$f":"IFERROR(_xlfn.IFS(D186=1,4,D186=2,3,D186=3,2,D186=4,1,D186=5,0,D186=6,\"\"),\"\")","v":""}]
[null,null,null,null,"(3) “I like how little tending it needs, but wish it needed less”"]
[null,null,null,null,"(2) “I am neutral”"]
[null,null,null,null,"(1) “I don’t like how much tending it needs”"]
[null,null,null,null,"(0) “I dislike it so much that I don’t like to cook with it.”"]
[null,null,null,null,"(No response recorded)"]
[]
[null,null,"4.10 B","“How important is it that your stove can be left without being tended for a long time?"]
[null,null,null,null,"(4) “Very important”",{"$f":"IFERROR(_xlfn.IFS(D194=1,4,D194=2,3,D194=3,2,D194=4,1,D194=5,0,D194=6,\"\"),\"\")","v":""}]
[null,null,null,null,"(3) “Important”"]
[null,null,null,null,"(2) “Somewhat important”"]
[null,null,null,null,"(1) “Unimportant”"]
[null,null,null,null,"(0) “Very unimportant”"]
[null,null,null,null,"(No response recorded)"]
[]
[null,null,"Notes:"]
[]
[null,null,"4.11 A","“Does your stove cook quickly or slowly?”"]
[null,null,null,null,"(4) “Very quickly”",{"$f":"IFERROR(_xlfn.IFS(D204=1,4,D204=2,3,D204=3,2,D204=4,1,D204=5,0,D204=6,\"\"),\"\")","v":""}]
[null,null,null,null,"(3) “Quickly”"]
[null,null,null,null,"(2) “Neither quickly nor slowly”"]
[null,null,null,null,"(1) “Slowly”"]
[null,null,null,null,"(0) “Very slowly”"]
[null,null,null,null,"(No response recorded)"]
[]
[null,null,"4.11 B","“How important is it that a stove cook quickly?”"]
[null,null,null,null,"(4) “Very important”",{"$f":"IFERROR(_xlfn.IFS(D212=1,4,D212=2,3,D212=3,2,D212=4,1,D212=5,0,D212=6,\"\"),\"\")","v":""}]
[null,null,null,null,"(3) “Important”"]
[null,null,null,null,"(2) “Somewhat important”"]
[null,null,null,null,"(1) “Unimportant”"]
[null,null,null,null,"(0) “Very unimportant”"]
[null,null,null,null,"(No response recorded)"]
[]
[null,null,"Notes:"]
[]
[null,null,"4.12 A","“How many of the different sizes of pots and pans you cook with fit on your stove?” "]
[null,null,null,null,"(4) “All”",{"$f":"IFERROR(_xlfn.IFS(D222=1,4,D222=2,3,D222=3,2,D222=4,1,D222=5,0,D222=6,\"\"),\"\")","v":""}]
[null,null,null,null,"(3) “More than half”"]
[null,null,null,null,"(2) “About half"]
[null,null,null,null,"(1) “Less than half”"]
[null,null,null,null,"(0) “None”"]
[null,null,null,null,"(No response recorded)"]
[]
[null,null,"4.12 B","“How important is it that a stove can cook with all of the sizes of  pots and pans you normally use?”"]
[null,null,null,null,"(4) “Very important”",{"$f":"IFERROR(_xlfn.IFS(D230=1,4,D230=2,3,D230=3,2,D230=4,1,D230=5,0,D230=6,\"\"),\"\")","v":""}]
[null,null,null,null,"(3) “Important”"]
[null,null,null,null,"(2) “Somewhat important”"]
[null,null,null,null,"(1) “Unimportant”"]
[null,null,null,null,"(0) “Very unimportant”"]
[null,null,null,null,"(No response recorded)"]
[]
[null,null,"Notes:"]
[]
[null,null,4.13,"\"How many different dishes do you usually cook at the same time during the main meal of the day?\""]
[null,null,null,null,"Number of dishes"]
[]
[null,null,"Notes:"]
[]
[null,null,"4.14 A","“Are any of the following true for you when you reload fuel or tend the fire in your stove?”"]
[null,null,null,false,"“I have to remove the pot”",{"$f":"IF(D248=FALSE,(COUNTIF(D245:D247,FALSE)),\"\")","v":""}]
[null,null,null,false,"“I am exposed to a lot of heat or sometimes burn myself”"]
[null,null,null,false,"“I am exposed to a lot of smoke”"]
[null,null,null,true,"(No response recorded)"]
[]
[null,null,"4.14 B","“How important is it that it is easy to reload and tend a stove?”"]
[null,null,null,null,"(4) “Very important”",{"$f":"IFERROR(_xlfn.IFS(D251=1,4,D251=2,3,D251=3,2,D251=4,1,D251=5,0,D251=6,\"\"),\"\")","v":""}]
[null,null,null,null,"(3) “Important”"]
[null,null,null,null,"(2) “Somewhat important”"]
[null,null,null,null,"(1) “Unimportant”"]
[null,null,null,null,"(0) “Very unimportant”"]
[null,null,null,null,"(No response recorded)"]
[]
[null,null,"Notes:"]
[]
[null,null,"4.15 A","“About how many minutes does it take for the fire to get hot enough to start cooking after you light it?"]
[null,null,null,null,"Time (minutes):"]
[]
[null,null,"4.15 B","“How important is it that a stove gets hot enough to cook on quickly?”"]
[null,null,null,null,"(4) “Very important”",{"$f":"IFERROR(_xlfn.IFS(D264=1,4,D264=2,3,D264=3,2,D264=4,1,D264=5,0,D264=6,\"\"),\"\")","v":""}]
[null,null,null,null,"(3) “Important”"]
[null,null,null,null,"(2) “Somewhat important”"]
[null,null,null,null,"(1) “Unimportant”"]
[null,null,null,null,"(0) “Very unimportant”"]
[null,null,null,null,"(No response recorded)"]
[]
[null,null,"Notes:"]
[]
[null,null,"4.16 A","“Do you routinely fix or maintain your stove? If so, how often?”"]
[null,null,null,null,"Interval (number of days, or \"never\"):"]
[]
[null,null,"4.16 B","“Do you agree or disagree that the routine maintenance of a stove is an important concern?”"]
[null,null,null,null,"(4) “Very important”",{"$f":"IFERROR(_xlfn.IFS(D277=1,4,D277=2,3,D277=3,2,D277=4,1,D277=5,0,D277=6,\"\"),\"\")","v":""}]
[null,null,null,null,"(3) “Important”"]
[null,null,null,null,"(2) “Somewhat important”"]
[null,null,null,null,"(1) “Unimportant”"]
[null,null,null,null,"(0) “Very unimportant”"]
[null,null,null,null,"(No response recorded)"]
[]
[null,null,"Notes:"]
[]
[null,null,"4.17 A","“Are any of the following true about the maintenance requirements of your stove?”"]
[null,null,null,false,"“It requires purchased replacement parts once a year or more”",{"$f":"IF(D290=FALSE,(COUNTIF(D287:D289,FALSE)),\"\")","v":""}]
[null,null,null,false,"“Necessary replacement parts are not available or hard to find”"]
[null,null,null,false,"“Necessary replacement parts are too expensive”"]
[null,null,null,true,"(No response recorded)"]
[null,null,null,null,null,"If parts are required, how much do they cost per year?"]
[null,null,null,null," Currency type:"]
[null,null,null,null,"Amount:"]
[]
[null,null,"4.17 B","“Do you agree or disagree that the long-term maintenance of a stove is an important concern?” "]
[null,null,null,null,"(4) “Very important”",{"$f":"IFERROR(_xlfn.IFS(D296=1,4,D296=2,3,D296=3,2,D296=4,1,D296=5,0,D296=6,\"\"),\"\")","v":""}]
[null,null,null,null,"(3) “Important”"]
[null,null,null,null,"(2) “Somewhat important”"]
[null,null,null,null,"(1) “Unimportant”"]
[null,null,null,null,"(0) “Very unimportant”"]
[null,null,null,null,"(No response recorded)"]
[]
[null,null,"Notes:"]
[]
[null,null,"4.18 A","\"Which of the following best describes how you feel about the safety of your stove?\""]
[null,null,null,null,"(4) \"It stove feels very safe to use\"",{"$f":"IFERROR(_xlfn.IFS(D306=1,4,D306=2,3,D306=3,2,D306=4,1,D306=5,0,D306=6,\"\"),\"\")","v":""}]
[null,null,null,null,"(3) \"It generally feels safe to use, but sometimes feels unsafe\""]
[null,null,null,null,"(2) “It is neither safe nor unsafe”"]
[null,null,null,null,"(1) \"It is not very safe to use\""]
[null,null,null,null,"(0) \"It is so unsafe that I do not want to use it\""]
[null,null,null,null,"(No response recorded)"]
[]
[null,null,"4.18 B","“How important is the safety of a stove?”"]
[null,null,null,null,"(4) “Very important”",{"$f":"IFERROR(_xlfn.IFS(D314=1,4,D314=2,3,D314=3,2,D314=4,1,D314=5,0,D314=6,\"\"),\"\")","v":""}]
[null,null,null,null,"(3) “Important”"]
[null,null,null,null,"(2) “Somewhat important”"]
[null,null,null,null,"(1) “Unimportant”"]
[null,null,null,null,"(0) “Very unimportant”"]
[null,null,null,null,"(No response recorded)"]
[]
[null,null,"Notes:"]
[]
[null,null,"4.19 A","\"Which of the following best describes the amount of smoke your stove creates in the area where you cook?\""]
[null,null,null,null,"(4) “The stove produces no smoke”",{"$f":"IFERROR(_xlfn.IFS(D324=1,4,D324=2,3,D324=3,2,D324=4,1,D324=5,0,D324=6,\"\"),\"\")","v":""}]
[null,null,null,null,"(3) “I like how little smoke there is”"]
[null,null,null,null,"(2) “I am neutral”"]
[null,null,null,null,"(1) \"I don't like the amount of smoke \""]
[null,null,null,null,"(0) \"There is so much smoke that I don't like to use this stove\""]
[null,null,null,null,"(No response recorded)"]
[]
[null,null,"4.19 B","“Is smoke in the cooking area an important concern to you?”"]
[null,null,null,null,"(4) “Very important”",{"$f":"IFERROR(_xlfn.IFS(D332=1,4,D332=2,3,D332=3,2,D332=4,1,D332=5,0,D332=6,\"\"),\"\")","v":""}]
[null,null,null,null,"(3) “Important”"]
[null,null,null,null,"(2) “Somewhat important”"]
[null,null,null,null,"(1) “Unimportant”"]
[null,null,null,null,"(0) “Very unimportant”"]
[null,null,null,null,"(No response recorded)"]
[]
[null,null,"Notes:"]
[]
[null,null,"4.20 A","\"Which of the following best describes how you feel about the height of this stove above the ground?\""]
[null,null,null,null,"(4) \"The height is perfect. I wouldn't change it\"",{"$f":"IFERROR(_xlfn.IFS(D342=1,4,D342=2,3,D342=3,2,D342=4,1,D342=5,0,D342=6,\"\"),\"\")","v":""}]
[null,null,null,null,"(3) \"The height is comfortable, but not perfect\""]
[null,null,null,null,"(2) “I am neutral”"]
[null,null,null,null,"(1) “The height makes it somewhat uncomfortable to use”"]
[null,null,null,null,"(0) “The height makes it is so uncomfortable that I don’t like using it”"]
[null,null,null,null,"(No response recorded)"]
[]
[null,null,"4.20 B","“How important is the height of a stove?”"]
[null,null,null,null,"(4) “Very important”",{"$f":"IFERROR(_xlfn.IFS(D350=1,4,D350=2,3,D350=3,2,D350=4,1,D350=5,0,D350=6,\"\"),\"\")","v":""}]
[null,null,null,null,"(3) “Important”"]
[null,null,null,null,"(2) “Somewhat important”"]
[null,null,null,null,"(1) “Unimportant”"]
[null,null,null,null,"(0) “Very unimportant”"]
[null,null,null,null,"(No response recorded)"]
[]
[null,null,"Notes:"]
[]
[null,null,"4.21 A","\"Which of the following best describes how you feel about the appearance of this stove?\""]
[null,null,null,null,"(4) \"I really like the way it looks. I would not change it\"",{"$f":"IFERROR(_xlfn.IFS(D360=1,4,D360=2,3,D360=3,2,D360=4,1,D360=5,0,D360=6,\"\"),\"\")","v":""}]
[null,null,null,null,"(3) \"It looks good, but could look better\""]
[null,null,null,null,"(2) “I am neutral”"]
[null,null,null,null,"(1) \"It does not look very attractive. I wish it was different”"]
[null,null,null,null,"(0) \"It is so ugly that I do not like having it in my house\""]
[null,null,null,null,"(No response recorded)"]
[]
[null,null,"4.21 B","“How important is the appearance of a stove?”"]
[null,null,null,null,"(4) “Very important”",{"$f":"IFERROR(_xlfn.IFS(D368=1,4,D368=2,3,D368=3,2,D368=4,1,D368=5,0,D368=6,\"\"),\"\")","v":""}]
[null,null,null,null,"(3) “Important”"]
[null,null,null,null,"(2) “Somewhat important”"]
[null,null,null,null,"(1) “Unimportant”"]
[null,null,null,null,"(0) “Very unimportant”"]
[null,null,null,null,"(No response recorded)"]
[]
[null,null,"Notes:"]
[]
[null,null,"4.22 A","\"Which of the following best describes how you feel about the durability of this stove?\""]
[null,null,null,null,"(4) \"It is very durable\"",{"$f":"IFERROR(_xlfn.IFS(D378=1,4,D378=2,3,D378=3,2,D378=4,1,D378=5,0,D378=6,\"\"),\"\")","v":""}]
[null,null,null,null,"(3) “It is somewhat durable”"]
[null,null,null,null,"(2) “I am neutral”"]
[null,null,null,null,"(1) \"It is not very durable\""]
[null,null,null,null,"(0) \"The durability is so poor that it is not worth using\""]
[null,null,null,null,"(No response recorded)"]
[]
[null,null,"4.22 B","“How important is the durability of a stove?”"]
[null,null,null,null,"(4) “Very important”",{"$f":"IFERROR(_xlfn.IFS(D386=1,4,D386=2,3,D386=3,2,D386=4,1,D386=5,0,D386=6,\"\"),\"\")","v":""}]
[null,null,null,null,"(3) “Important”"]
[null,null,null,null,"(2) “Somewhat important”"]
[null,null,null,null,"(1) “Unimportant”"]
[null,null,null,null,"(0) “Very unimportant”"]
[null,null,null,null,"(No response recorded)"]
[]
[null,null,"Notes:"]
[]
[null,null,"4.23 A","\"Which of the following best describes how you feel about the value of this stove?\""]
[null,null,null,null,"(4) \"It is a very good value for the cost\"",{"$f":"IFERROR(_xlfn.IFS(D396=1,4,D396=2,3,D396=3,2,D396=4,1,D396=5,0,D396=6,\"\"),\"\")","v":""}]
[null,null,null,null,"(3) \"It is a good value for the cost\""]
[null,null,null,null,"(2) “I am neutral”"]
[null,null,null,null,"(1) \"It is not a very good value for the cost\""]
[null,null,null,null,"(0) \"It is a bad value for the cost\""]
[null,null,null,null,"(No response recorded)"]
[]
[null,null,"4.23 B","“How important is the value of a stove in your decision to use it?”"]
[null,null,null,null,"(4) “Very important”",{"$f":"IFERROR(_xlfn.IFS(D404=1,4,D404=2,3,D404=3,2,D404=4,1,D404=5,0,D404=6,\"\"),\"\")","v":""}]
[null,null,null,null,"(3) “Important”"]
[null,null,null,null,"(2) “Neither important nor unimportant”"]
[null,null,null,null,"(1) “Unimportant”"]
[null,null,null,null,"(0) “Very unimportant”"]
[null,null,null,null,"(No response recorded)"]
[]
[null,null,"Notes:"]
[]
[null,null,4.24,"Location-specifc needs"]
[null,null,null,null,null,null,null,null,"Important feature?",null,"Need met by stove?"]
[null,null,null,1,"Space heating",{"$f":"IF(OR(ISBLANK(I415),I415=\"no\"),\"N/A\",IF(AND(I415=\"yes\",K415=\"no\"),\"Fail\",\"Pass\"))","v":"N/A"}]
[null,null,null,2,"Insect repellent",{"$f":"IF(OR(ISBLANK(I416),I416=\"no\"),\"N/A\",IF(AND(I416=\"yes\",K416=\"no\"),\"Fail\",\"Pass\"))","v":"N/A"}]
[null,null,null,3,"Lighting","N/A"]
[null,null,null,4,"Portability","N/A"]
[null,null,null,5,"Water heating","N/A"]
[null,null,null,6,"Food drying or smoking","N/A"]
[null,null,null,7,"Other: [enter]","N/A"]
[null,null,null,8,"Other: [enter]","N/A"]
[]
[null,null,"4.25 A","\"Does this stove make the flavor or taste of your food better or worse than other stoves?”"]
[null,null,null,null,"(4) “Much better”",{"$f":"IFERROR(_xlfn.IFS(D425=1,4,D425=2,3,D425=3,2,D425=4,1,D425=5,0,D425=6,\"\"),\"\")","v":""}]
[null,null,null,null,"(3) “A little better”"]
[null,null,null,null,"(2) “Neither better nor worse”"]
[null,null,null,null,"(1) “A little worse”"]
[null,null,null,null,"(0) “Much worse”"]
[null,null,null,null,"(No response recorded)"]
[]
[null,null,"4.25 B","“How important is the flavor or taste added by a stove?”"]
[null,null,null,null,"(4) “Very important”",{"$f":"IFERROR(_xlfn.IFS(D433=1,4,D433=2,3,D433=3,2,D433=4,1,D433=5,0,D433=6,\"\"),\"\")","v":""}]
[null,null,null,null,"(3) “Important”"]
[null,null,null,null,"(2) “Somewhat important”"]
[null,null,null,null,"(1) “Unimportant”"]
[null,null,null,null,"(0) “Very unimportant”"]
[null,null,null,null,"(No response recorded)"]
[]
[null,null,"Notes:"]
[]
[null,null,4.2599999999999971,"“How long have you been using this particular kind of stove” "]
[null,null,null,null,"Duration:"]
[null,null,null,null,"Unit of time (days, weeks, months, or years):"]
[]
[null,null,"Notes:"]
[]
[null,null,4.2699999999999996,"“Did your stove come with a paper instruction manual, or were you trained how to use your cookstove?”"]
[null,null,null,null,"(4) Yes, and it was good enough",{"$f":"IFERROR(_xlfn.IFS(D449=1,4,D449=2,2,D449=3,0,D449=4,\"\"),\"\")","v":""}]
[null,null,null,null,"(2) Yes, but it was not good enough"]
[null,null,null,null,"(0) No"]
[null,null,null,null,"(No response recorded)"]
[]
[null,null,"Notes:",null,null,null,null,null,null,"Interview Coding"]
[null,null,null,null,null,null,null,null,null,"Select or enter up to four main themes or concepts from each question response in the cells, below. Use the same code for closely related ideas for best results.                                             A few examples are provided."]
[]
[null,"5. Semi-Structured Interview",5.0999999999999996,"\"Can you list a few of your favorite things about your stove? Why are they important to you?\""]
[]
[]
[null,null,5.2,"\"Can you list a few of your least favorite things about your stove? Why are they important to you?\""]
[]
[]
[null,null,5.3,"“Is there anything you would like to change about your stove?”"]
[]
[]
[null,null,5.4,"\"Is there anything else you would like to tell me about your stove or cooking in general?\""]
[]
[]
[null,null,5.5,"Additional question(s) and response(s). "]